program: Gaussian 09
title: 000205668
version: EM64L-G09RevD.01
frameworkgroup: C1[X(C9H12BrN)]
method: RPBEPBE
basis: SDD
operation: Freq
keyword: #p
keyword: freq=noraman
keyword: PBEPBE/SDD
title: #p freq=noraman PBEPBE/SDD
converged: YES YES NO NO
title: Mulliken charges:
elementType: Br N C C C C C C C C C H H H H H H H H H H H H
charge: -0.001664 -0.546831 -0.124183 -0.565334 0.510468 -0.689877 -0.388467 -0.411740 -0.190011 -0.187645 -0.213070 0.224747 0.242407 0.194457 0.234815 0.197259 0.212007 0.243129 0.239778 0.267428 0.255662 0.248318 0.248345
chargesum: 0.00000
title: Mulliken charges with hydrogens summed into heavy atoms:
elementType: Br N C C C C C C C C C
charge: -0.001664 -0.023740 0.100564 -0.128470 0.510468 -0.045795 -0.145337 -0.171962 0.058307 0.060700 -0.213070
polarizability: 1.80902491e+02 -3.96772355e+00 1.00914027e+02 -1.10244938e+01 -9.75392434e+00 7.22145236e+01
1716.lowfreq: -23.1402 -6.6626 -0.0005 -0.0005 -0.0004 6.5550 35.2378 46.7905 61.9250
frequency: 33.1241 46.7293 61.8852 143.9173 196.7862 212.2532 237.4631 256.2268 297.7718 360.2661 367.7316 399.6685 407.5978 432.8785 510.8356 625.5554 628.6766 658.0147 713.4914 788.0816 821.3765 833.2078 845.4799 889.2619 939.1073 956.6303 970.1934 995.3579 1006.6677 1057.3804 1060.7025 1108.9370 1146.9820 1156.0363 1185.9731 1215.3302 1231.9999 1293.9002 1312.0364 1321.4444 1361.1565 1372.6965 1381.1374 1392.0448 1461.6035 1471.5797 1473.2435 1477.2346 1580.1084 1596.5832 1638.9589 2964.5423 2976.4022 2993.4535 3048.3454 3063.0821 3072.8149 3126.2729 3129.2198 3165.6902 3169.1365 3420.7603 3545.6864
redmass: 3.2709 4.3047 3.9827 5.1798 2.1183 1.8838 1.1762 3.1006 3.6637 2.5451 3.2851 2.6040 2.8904 2.0527 2.8213 6.8489 4.8223 1.4949 3.8099 2.2127 3.1938 1.2552 1.8446 1.4045 1.6156 1.4004 1.3731 4.8044 1.4479 2.0170 2.4056 1.4997 1.4654 2.0340 1.1110 2.5117 1.4508 1.2794 1.5374 1.3251 1.3274 6.2526 1.2298 2.5050 1.0611 2.0399 1.1364 1.1108 7.1785 6.2314 1.0926 1.0362 1.0658 1.0806 1.0996 1.0990 1.0994 1.0897 1.0897 1.0950 1.0959 1.0448 1.0961
irintensity: 0.2763 0.5851 0.1070 0.1170 6.8249 24.5465 8.1317 17.8720 1.7657 0.3683 34.5567 2.4502 0.0898 5.4124 26.8315 0.5282 8.6495 240.5292 2.3429 33.3933 8.3208 0.1810 35.0812 3.4239 1.6559 0.1967 0.1479 50.4872 1.1978 4.5671 30.7288 16.4814 21.7199 21.4711 1.3328 0.7406 12.4577 1.2092 3.3309 6.4524 15.2620 0.4501 18.2806 6.2486 1.5150 79.7089 7.7395 17.2465 0.5064 5.4778 33.6324 23.7671 15.4772 34.6840 15.9969 50.8001 50.7747 9.8496 13.5402 10.4813 0.7217 3.0226 0.0943
temp: 298.150 k
press: 1.00000 atm
elementType: 35 7 6 6 6 6 6 6 6 6 6 1 1 1 1 1 1 1 1 1 1 1 1
symmnumber: 1
zpe: 494109.8 jmol-1
zpe.correction: 0.188196 hartree
zpe.thermalcorrener: 0.199866 hartree
zpe.thermalcorrenthalpy: 0.200810 hartree
zpe.thermalcorrgfe: 0.148637 hartree
zpe.sumelectzpe: -417.534459 hartree
zpe.sumelectthermal: -417.522789 hartree
zpe.sumelectthermalent: -417.521845 hartree
zpe.sumelectthermalfe: -417.574018 hartree
dipole: 2.8631 0.9974 0.4195
dipole: 3.0607
quadrupole: -73.0726 -72.2419 -77.2577
quadrupole: 5.6566 2.8231 -4.4165
quadrupole: 1.1181 1.9488 -3.0669 5.6566 2.8231 -4.4165
hfenergy: -417.722655 hartree
pointgroup: C01 [X(C9H12Br1N1)]
dipole: -1.149185 0.3517904 -0.0751284 debye
dipolederiv: -0.7525058 -0.0694289 0.1282065 -0.0812075 -0.0824174 0.0039389 0.1509553 0.0037529 -0.0818393 -0.6761689 -0.1612162 0.0699118 -0.2566548 -0.6387869 0.2426321 0.0007309 0.2264139 -0.2825089 0.6746146 0.1333402 -0.0475896 0.0281861 0.3877366 -0.1083063 0.1647134 -0.1063619 0.2310645 -0.1437805 -0.024784 -0.0587197 -0.0597493 0.0911475 0.072638 -0.2298384 0.0474886 0.0665061 0.3864196 0.01968 -0.0124307 0.0640888 -0.052945 -0.0200567 -0.0786896 -0.017023 -0.0701003 -0.063049 -0.0286354 -0.0045021 -0.0811656 -0.1453868 0.1326283 -0.0323976 0.1359486 0.0123945 -0.0857249 0.0530137 -0.0258933 0.0332059 0.0351373 0.0749347 -0.0081469 0.0710834 -0.111637 -0.086781 -0.0295214 -0.0578924 -0.0192096 0.0271002 0.0724989 -0.029313 0.0744892 -0.1097316 -0.3528905 -0.1111266 0.01383 -0.0594179 0.0013726 0.0512887 0.0387094 0.0688614 -0.0749385 -0.3557076 0.055005 0.0839678 0.0009194 0.0190081 0.0518886 0.0638594 0.0377111 -0.0881716 1.2518457 0.1465187 -0.2787774 0.1580759 0.0053499 0.0207761 -0.2956024 0.0210745 -0.0493042 0.0008197 0.0373759 0.05752 0.0464749 -0.0735813 -0.086194 0.0719387 -0.0656028 -0.0570251 0.0255566 -0.0083083 0.0217673 -0.0212544 -0.0815387 0.0999055 0.0334683 0.0622248 0.0373771 -0.0115486 0.0217572 0.0444206 0.0801186 -0.0287527 -0.1439476 0.0591607 -0.0757552 -0.0339079 -0.1241228 -0.0845586 0.090887 -0.0970342 0.0335978 0.0183252 0.1203397 0.011043 0.0706151 0.0669263 0.0463492 0.0449276 0.0412828 -0.0363377 -0.0679297 0.0827058 -0.140173 -0.05266 -0.0417372 0.0344982 -0.1432212 0.0135576 0.0653529 0.0094237 -0.162497 0.0407527 -0.087135 0.0171627 -0.1018704 -0.0009919 -0.0945358 -0.021725 -0.0522599 0.0020785 -0.0503609 0.1182214 0.0006996 0.0752282 0.0789587 0.0631738 0.0014821 -0.071198 0.0758557 -0.0755937 0.0974518 0.0219861 0.0060705 -0.0635744 0.1495564 0.3332644 0.0334339 -0.1188608 -0.0214913 0.0410178 0.1420683 0.004538 0.0193121 0.1127997 0.1387197 -0.2087791 0.0395371 -0.1229547 0.1707205 0.0501778 0.0592325 0.0498687 0.0569738 0.0245788 -0.0708981 0.0546509 -0.0722837 0.1161661 0.0557396 -0.0731577 -0.0099853 -0.0781845 -0.0023761 -0.054743 -0.003358 -0.0532438 0.1374245 unknown
polarizability: 179.1810435|9.7913404|99.0157573|-15.063771|11.8903002|75.8342409 unknown
InChI: InChI=1S/C9H12BrN/c1-7(11)6-8-2-4-9(10)5-3-8/h2-5,7H,6,11H2,1H3
charge 0 multiplicity 1
23 atoms
Br 4.415014 0.300332 -0.492932
N  -4.017069 -0.666941 -0.070741
C  -2.642568 -0.25555 -0.454246
C  -1.73237 -0.406375 0.801975
C  -0.250737 -0.232659 0.513355
C  -2.558557 1.16507 -1.069989
C  0.481015 -1.265371 -0.129767
C  0.438215 0.958884 0.853516
C  1.85338 -1.119913 -0.431975
C  1.811993 1.127556 0.562413
C  2.502312 0.081871 -0.081289
H  -2.291519 -0.987394 -1.209072
H  -1.934152 -1.411951 1.215117
H  -2.060954 0.331474 1.562217
H  -1.527517 1.419455 -1.376651
H  -2.896108 1.924281 -0.336989
H  -3.209186 1.239408 -1.961346
H  -0.023953 -2.202995 -0.392244
H  -0.100971 1.770725 1.356046
H  -4.656647 -0.738153 -0.871106
H  -4.41931 -0.068272 0.662296
H  2.40449 -1.926533 -0.924113
H  2.329399 2.052149 0.833925
