program: Gaussian 09
title: 000205666
version: EM64L-G09RevD.01
frameworkgroup: C1[X(C10H13N3O)]
method: RPBEPBE
basis: SDD
operation: Freq
keyword: #p
keyword: freq=noraman
keyword: PBEPBE/SDD
title: #p freq=noraman PBEPBE/SDD
converged: YES YES NO NO
title: Mulliken charges:
elementType: O N N N C C C C C C C C C C H H H H H H H H H H H H H
charge: -0.247304 0.030829 -0.292763 -0.639051 -0.456452 -0.552595 0.502317 -0.268757 -0.403174 -0.398258 0.226915 -0.223034 -0.223394 -0.237484 0.261116 0.239797 0.234857 0.237524 0.208304 0.218026 0.233514 0.233332 0.228666 0.229454 0.232703 0.294159 0.330751
chargesum: 0.00000
title: Mulliken charges with hydrogens summed into heavy atoms:
elementType: O N N N C C C C C C C C C C
charge: -0.247304 0.030829 -0.074736 -0.014140 0.044460 -0.080214 0.502317 -0.060453 -0.169660 -0.164926 0.226915 0.005632 0.006061 -0.004781
polarizability: 1.93932066e+02 1.35267649e+01 1.52531096e+02 1.50239052e+01 -3.48400257e+00 6.79458127e+01
1716.lowfreq: -8.4376 -2.8471 -0.0010 -0.0009 -0.0009 12.9266 20.5485 25.1120 29.6311
frequency: 19.3650 24.8737 29.3375 53.7775 77.7410 125.3993 189.3310 210.0732 258.6214 330.0720 371.8402 376.9939 395.7743 403.1236 486.2800 490.9452 516.5938 543.8302 578.4935 617.3648 620.3435 676.6363 706.6123 708.1505 742.4978 761.2659 803.9123 824.4702 855.6995 900.0334 912.8134 931.2066 978.3906 990.1398 998.0786 1018.2192 1025.4964 1029.7228 1034.6022 1092.0178 1147.4705 1168.9179 1174.4249 1187.6750 1216.9161 1254.5796 1269.5732 1287.2894 1317.9234 1327.9197 1349.5975 1382.7006 1441.3073 1454.1399 1472.7281 1484.1423 1492.1201 1564.5074 1593.4787 1595.4762 1614.0524 1614.9294 3004.7283 3023.1094 3061.9329 3097.0080 3115.1619 3116.4020 3134.6393 3147.0720 3165.5046 3171.6499 3207.9096 3522.6025 3683.2751
redmass: 4.0728 6.8179 4.4583 3.1434 4.6790 4.2005 5.2636 4.7115 3.9049 2.3124 1.2528 3.2654 5.0773 2.8341 3.5060 1.1080 2.9723 2.9093 2.6247 6.3657 2.1163 3.4861 1.6038 1.3627 5.6094 1.8849 1.2037 3.6632 1.2464 3.6187 2.1918 2.1616 1.3870 6.2790 1.3204 1.7770 2.2662 2.2522 3.2957 1.5064 3.1531 1.2201 1.0552 1.1140 2.4915 2.5017 1.2575 1.3248 1.5049 1.2555 1.3511 7.9697 2.1646 1.5208 1.2039 2.2197 1.1541 2.9033 4.1620 2.9893 6.1627 1.8284 1.0595 1.0599 1.1024 1.1064 1.0886 1.0872 1.0900 1.0955 1.1014 1.0901 1.0758 1.0443 1.1044
irintensity: 3.8401 5.8358 4.2940 1.1379 0.1346 2.1172 8.0425 6.5775 12.3067 0.5510 159.0274 13.1034 13.9392 0.1354 16.9701 122.6551 14.7912 2.6651 6.7954 0.0249 2.8558 7.7432 130.9699 46.4326 9.1429 53.3878 0.2916 4.0134 0.0094 33.4291 7.5402 5.3261 0.0070 0.5253 0.0869 1.1548 5.2331 1.4908 5.7958 16.8934 48.2884 3.7172 0.0732 0.1498 0.0531 120.6100 36.6687 3.4423 222.3163 1.0550 14.8752 0.0132 8.3419 68.7764 14.6302 15.9868 16.1414 237.8295 19.8985 20.2885 6.2740 198.2791 10.2406 23.9469 3.4821 8.6700 7.2850 12.5299 6.6085 35.5759 21.7598 4.3399 10.6755 41.2065 25.9969
temp: 298.150 k
press: 1.00000 atm
elementType: 8 7 7 7 6 6 6 6 6 6 6 6 6 6 1 1 1 1 1 1 1 1 1 1 1 1 1
symmnumber: 1
zpe: 571653.5 jmol-1
zpe.correction: 0.217731 hartree
zpe.thermalcorrener: 0.231519 hartree
zpe.thermalcorrenthalpy: 0.232463 hartree
zpe.thermalcorrgfe: 0.173946 hartree
zpe.sumelectzpe: -627.244002 hartree
zpe.sumelectthermal: -627.230214 hartree
zpe.sumelectthermalent: -627.229270 hartree
zpe.sumelectthermalfe: -627.287787 hartree
dipole: -5.7996 4.1428 -1.7724
dipole: 7.3444
quadrupole: -97.1912 -73.4859 -87.3791
quadrupole: 21.7285 -2.6202 0.6276
quadrupole: -11.1725 12.5328 -1.3604 21.7285 -2.6202 0.6276
hfenergy: -627.4617332 hartree
pointgroup: C01 [X(C10H13N3O1)]
dipole: 2.3386277 1.5599411 0.6682579 debye
polarizability: 191.9550193|-14.5018491|153.877706|18.4272436|-1.7549952|68.5762496 unknown
InChI: InChI=1S/C10H13N3O/c11-10(14)8-13(12)7-6-9-4-2-1-3-5-9/h1-5,8,12H,6-7,11H2
charge 0 multiplicity 1
27 atoms
O  -4.830737 -0.425674 -0.572738
N  -1.91756 -0.561911 0.227334
N  -2.344758 -1.814429 -0.002192
N  -4.685279 1.857877 -0.165571
C  -0.450496 -0.317358 0.5315
C  0.406399 -0.379695 -0.759507
C  1.877274 -0.156343 -0.435842
C  -2.702448 0.55066 0.152913
C  2.430342 1.149889 -0.439646
C  2.712782 -1.247263 -0.08309
C  -4.122681 0.568302 -0.219187
C  3.784799 1.36256 -0.097372
C  4.067682 -1.039513 0.259569
C  4.607482 0.26772 0.255472
H  -0.131517 -1.095487 1.248209
H  -0.339403 0.665621 1.018042
H  0.264299 -1.364329 -1.242051
H  0.040093 0.389565 -1.463448
H  -2.194317 1.487686 0.387319
H  -1.509987 -2.438095 0.131346
H  1.800233 2.00261 -0.723151
H  2.303173 -2.265562 -0.088065
H  4.199098 2.376888 -0.111522
H  4.701643 -1.893238 0.523841
H  5.658589 0.430653 0.518013
H  -4.175332 2.683968 0.140903
H  -5.668374 1.9434 -0.417776
