program: Gaussian 09
title: 000205663
version: EM64L-G09RevD.01
frameworkgroup: C1[X(C16H16ClNO3S)]
method: RPBEPBE
basis: SDD
operation: Freq
keyword: #p
keyword: freq=noraman
keyword: PBEPBE/SDD
title: #p freq=noraman PBEPBE/SDD
converged: YES YES NO NO
title: Mulliken charges:
elementType: Cl S O O O N C C C C C C C C C C C C C C C C H H H H H H H H H H H H H H H H
charge: -0.053790 0.885263 -0.556625 -0.553647 -0.257055 -0.474717 -0.261215 -0.068380 -0.651971 -0.655872 -0.258591 -0.270299 0.268337 -0.329601 -0.344099 0.136649 0.511260 -0.325820 -0.440505 -0.196852 -0.182541 -0.121720 0.265910 0.223846 0.242899 0.270536 0.230424 0.262624 0.233481 0.289579 0.297755 0.287143 0.228183 0.313568 0.315557 0.225717 0.257646 0.256923
chargesum: 0.00000
title: Mulliken charges with hydrogens summed into heavy atoms:
elementType: Cl S O O O N C C C C C C C C C C C C C C C C
charge: -0.053790 0.885263 -0.556625 -0.553647 -0.257055 -0.161149 0.004695 -0.068380 0.085309 0.070658 0.030988 0.027456 0.268337 -0.042458 -0.115916 0.136649 0.511260 -0.010263 -0.214788 0.060794 0.074383 -0.121720
polarizability: 4.18424373e+02 -7.81689614e+00 2.05395486e+02 4.35707749e+00 -1.65115663e+01 1.29653312e+02
1716.lowfreq: -10.6512 -2.1455 -0.0012 -0.0010 0.0013 1.8432 14.6813 23.5731 28.0543
frequency: 14.2190 23.5621 28.0126 40.0130 51.6402 56.6629 77.2186 104.7389 120.7806 136.0429 151.0400 172.3976 194.0757 206.8785 216.4111 235.8269 255.9008 260.5010 284.1171 288.9510 332.7804 352.5783 359.5067 365.7159 394.5304 406.8480 411.4738 417.5162 459.3946 479.6375 489.8206 510.2674 542.7389 617.7956 621.9006 633.2855 645.9083 679.9479 701.4909 705.6972 750.2269 788.4731 814.0049 815.4008 845.7263 847.6567 864.7596 870.1051 874.8592 911.2835 932.6199 938.0499 942.6636 974.0513 983.9628 993.5591 994.9225 998.3085 1040.4321 1053.5377 1072.4747 1085.6979 1112.6827 1117.7059 1136.0263 1166.6305 1183.8541 1185.3186 1225.5006 1238.4140 1256.7605 1293.0947 1297.7171 1308.7194 1366.0921 1379.5510 1382.1855 1388.8216 1397.4013 1401.5685 1451.7578 1465.0820 1466.4554 1468.8467 1479.8147 1488.2054 1504.8954 1574.8379 1590.8628 1595.5355 1605.9324 1609.0598 2983.7774 2987.3182 3047.3135 3076.2820 3082.9763 3095.7839 3103.4970 3118.3152 3123.4789 3150.9111 3153.9630 3167.7232 3170.9476 3173.5370 3200.1717 3533.6782
redmass: 5.9972 4.9636 2.9022 6.0352 4.1309 6.3518 6.5896 6.5730 8.1712 9.7060 6.4117 2.0845 1.2808 5.5872 4.0914 1.3972 7.7094 6.7178 6.1580 5.2426 5.5979 4.8164 3.6224 4.9066 5.5656 2.8623 3.0441 6.9104 3.4797 6.6529 4.1677 2.8374 5.3373 6.1370 6.0111 2.4532 1.9980 4.8558 6.8488 3.5532 3.4828 13.6613 1.8868 2.6585 1.6616 1.4084 2.4172 2.6618 1.9994 5.6347 1.2287 1.3596 1.3849 1.3739 1.3182 4.2012 3.4659 1.5830 1.3716 2.9139 3.0214 2.5848 1.3556 1.3655 2.1985 1.8433 1.1290 1.1186 1.2881 3.5843 1.9769 1.2651 1.3869 1.5612 5.0329 4.3307 1.2206 5.0293 1.1944 4.3683 1.0439 1.7974 1.1606 1.0578 2.5023 1.0527 2.3068 7.8405 6.3508 5.6687 5.8035 5.7264 1.0358 1.0360 1.0873 1.0981 1.0983 1.1006 1.1005 1.0904 1.0893 1.0891 1.0952 1.0914 1.0965 1.0951 1.0953 1.0759
irintensity: 0.9927 1.6807 0.2040 1.6197 0.2272 2.1032 3.5949 4.7436 2.6660 2.8505 0.2824 0.5418 0.9160 7.2684 17.5558 5.4104 1.9122 5.9489 1.0639 18.0096 2.3134 0.3600 11.6005 7.5851 7.9715 0.0216 0.3047 18.3146 6.4631 34.5270 26.1125 38.3613 85.8609 3.2249 1.6516 10.6470 23.3915 28.6504 36.5357 0.4475 20.7525 92.2599 29.5117 23.0809 16.3401 58.5101 12.6397 1.5520 21.9617 60.2881 18.8942 1.0519 2.6922 0.0949 3.4894 39.9678 11.9720 0.2638 38.2316 65.7280 52.2448 0.0584 14.7369 15.8498 0.2950 40.3129 0.8566 1.8267 23.6087 56.5407 30.8781 4.2181 21.3227 0.1811 147.0669 2.5287 31.4434 15.8462 28.5465 23.3013 10.6675 13.6568 12.7432 1.9108 159.2163 19.5069 524.5117 55.2111 11.3067 34.0484 6.1641 59.4202 10.4623 22.5724 5.5587 12.0430 9.2409 12.9424 14.0326 14.3236 13.6146 1.3085 8.9464 2.2926 0.1811 2.2159 9.0655 10.1263
temp: 298.150 k
press: 1.00000 atm
elementType: 17 16 8 8 8 7 6 6 6 6 6 6 6 6 6 6 6 6 6 6 6 6 1 1 1 1 1 1 1 1 1 1 1 1 1 1 1 1
symmnumber: 1
zpe: 746168.3 jmol-1
zpe.correction: 0.284201 hartree
zpe.thermalcorrener: 0.306471 hartree
zpe.thermalcorrenthalpy: 0.307415 hartree
zpe.thermalcorrgfe: 0.229476 hartree
zpe.sumelectzpe: -1756.118106 hartree
zpe.sumelectthermal: -1756.095835 hartree
zpe.sumelectthermalent: -1756.094891 hartree
zpe.sumelectthermalfe: -1756.172830 hartree
dipole: -0.0413 -5.0493 -4.0048
dipole: 6.4448
quadrupole: -175.2144 -141.5363 -149.2955
quadrupole: 8.7413 27.9712 -1.4260
quadrupole: -19.8656 13.8124 6.0532 8.7413 27.9712 -1.4260
hfenergy: -1756.402306 hartree
pointgroup: C01 [X(C16H16Cl1N1O3S1)]
dipole: -0.0216769 2.0990168 -1.422273 debye
polarizability: 418.6276842|-3.5317184|202.3010043|-5.2562489|21.8929881|132.5444827 unknown
InChI: InChI=1S/C16H16ClNO3S/c1-11(2)22(20,21)15-9-3-12(4-10-15)16(19)18-14-7-5-13(17)6-8-14/h3-11,18H,1-2H3
charge 0 multiplicity 1
38 atoms
Cl -8.192507 0.472786 -0.070294
S  4.804458 0.009727 0.506989
O  4.995321 0.966065 1.827029
O  5.511403 -1.464633 0.387966
O  -1.685783 -2.106709 -0.466394
N  -2.145354 0.129844 0.082662
C  5.39012 1.062515 -1.093495
C  2.933514 -0.246177 0.293311
C  6.911716 0.932982 -1.124371
C  4.836736 2.474123 -0.930612
C  2.485807 -1.342346 -0.463568
C  2.070206 0.628089 0.971979
C  0.183294 -0.650543 0.049183
C  1.094529 -1.537593 -0.581866
C  0.679735 0.418247 0.843359
C  -1.287648 -0.949868 -0.128044
C  -3.567729 0.151463 0.029985
C  -4.355064 -1.005175 -0.220778
C  -4.207876 1.402367 0.246117
C  -5.761801 -0.899485 -0.248982
C  -5.612115 1.507476 0.216276
C  -6.374085 0.348723 -0.031353
H  4.902615 0.488071 -1.901379
H  7.292877 1.376635 -2.06328
H  7.372561 1.469048 -0.276251
H  7.223345 -0.125041 -1.086039
H  5.19984 3.103002 -1.7652
H  5.190346 2.9194 0.016309
H  3.732992 2.496713 -0.944218
H  3.203767 -2.036591 -0.912734
H  2.483027 1.416366 1.610808
H  0.685985 -2.382921 -1.144212
H  0.002036 1.065706 1.412609
H  -1.704893 1.03533 0.258358
H  -3.8642 -1.963799 -0.394204
H  -3.610556 2.302307 0.440236
H  -6.371321 -1.787093 -0.440663
H  -6.101501 2.470984 0.38336
