program: Gaussian 09
title: 000205645
version: EM64L-G09RevD.01
frameworkgroup: C1[X(C11H10N2O2)]
method: RPBEPBE
basis: SDD
operation: Freq
keyword: #p
keyword: freq=noraman
keyword: PBEPBE/SDD
title: #p freq=noraman PBEPBE/SDD
converged: YES YES NO NO
title: Mulliken charges:
elementType: O O N N C C C C C C C C C C C H H H H H H H H H H
charge: -0.289816 -0.254261 -0.395025 -0.074495 0.412135 -0.442053 0.227741 -0.420320 0.212798 -0.338617 -0.337748 -0.218140 -0.217576 -0.216457 -0.221241 0.233259 0.260491 0.313865 0.271850 0.271261 0.264650 0.258187 0.234970 0.231078 0.233464
chargesum: 0.00000
title: Mulliken charges with hydrogens summed into heavy atoms:
elementType: O O N N C C C C C C C C C C C
charge: -0.289816 -0.254261 -0.081160 -0.074495 0.412135 0.051696 0.227741 -0.148470 0.212798 -0.067355 -0.073098 0.040047 0.017394 0.014622 0.012223
polarizability: 1.77932782e+02 7.06571069e+00 1.33736568e+02 -4.79893664e+00 1.11162326e+01 9.09048870e+01
1716.lowfreq: -2.5080 -0.0006 0.0005 0.0006 2.9219 13.1746 24.4991 31.8104 33.5160
frequency: 24.2324 31.8005 33.5025 63.6906 139.6293 145.0824 196.6657 246.8734 303.1706 346.9446 403.5481 413.9161 441.5741 490.7518 614.1612 626.0980 644.2628 657.2131 659.6492 677.6502 700.9380 734.3541 757.4996 787.3181 795.8984 836.6532 860.0722 864.6574 892.8081 954.9868 959.6138 990.5829 995.8100 999.2206 1009.3916 1011.6954 1038.0297 1085.0061 1091.6714 1114.4499 1174.5973 1181.0743 1211.4098 1237.9728 1244.0653 1252.8638 1314.2914 1341.0163 1346.7611 1367.5665 1390.2159 1429.0590 1438.1890 1452.0156 1477.8315 1561.6111 1585.6787 1611.4576 1625.6882 3038.0269 3110.2829 3130.5128 3143.2086 3155.8057 3167.9618 3178.9855 3233.9747 3240.8427 3582.2773
redmass: 4.7422 3.8463 7.0299 6.9759 5.7729 4.9086 6.3403 6.3611 5.7839 2.2096 2.8235 6.6048 3.9715 6.4295 6.4368 4.1104 1.7867 5.4270 1.7052 5.0101 1.6267 4.0572 5.2032 1.4330 2.1753 1.7945 4.4762 1.2468 5.9666 1.4211 2.1545 6.2262 1.3884 3.2822 1.3300 4.5392 2.2596 1.6103 1.9970 1.9241 1.0567 1.1314 1.3393 3.4628 1.8218 1.7001 1.3212 1.3284 3.0439 3.1399 10.0683 2.5013 2.2391 1.2063 2.2845 4.7645 6.6274 6.1084 10.0586 1.0586 1.1066 1.0856 1.0892 1.0940 1.0977 1.0978 1.0969 1.1013 1.0821
irintensity: 0.3000 5.9809 1.6845 1.3245 0.9551 3.4825 1.3030 13.9767 1.8428 14.9925 0.0018 1.9966 0.6388 6.9781 0.7412 5.5498 110.0014 1.9805 18.4504 11.5629 80.9095 37.7583 5.5307 28.4893 22.3227 108.4738 63.6688 0.1355 9.1275 4.2576 3.5293 2.6240 0.0706 14.9349 0.3683 226.7975 127.9005 17.2975 24.6244 11.3538 0.0557 47.2568 12.6351 273.2761 21.9705 18.0535 2.4914 18.4195 29.3196 10.7732 2.9276 28.4092 17.3138 21.7858 4.3470 2.4983 29.7547 11.5100 149.7392 35.8842 2.9978 0.2566 11.4120 15.7710 20.2793 8.6588 3.0485 1.4300 34.5280
temp: 298.150 k
press: 1.00000 atm
elementType: 8 8 7 7 6 6 6 6 6 6 6 6 6 6 6 1 1 1 1 1 1 1 1 1 1
symmnumber: 1
zpe: 501632.0 jmol-1
zpe.correction: 0.191062 hartree
zpe.thermalcorrener: 0.203677 hartree
zpe.thermalcorrenthalpy: 0.204621 hartree
zpe.thermalcorrgfe: 0.148983 hartree
zpe.sumelectzpe: -684.056560 hartree
zpe.sumelectthermal: -684.043945 hartree
zpe.sumelectthermalent: -684.043001 hartree
zpe.sumelectthermalfe: -684.098639 hartree
dipole: 2.4594 4.1155 2.4495
dipole: 5.3839
quadrupole: -85.5519 -78.5283 -88.9925
quadrupole: -7.1776 -13.7451 0.9110
quadrupole: -1.1944 5.8293 -4.6349 -7.1776 -13.7451 0.9110
hfenergy: -684.247622 hartree
pointgroup: C01 [X(C11H10N2O2)]
dipole: -0.8314772 1.4368605 -1.315574 debye
dipolederiv: -1.8381522 -0.1296287 0.1241318 -0.22666 -0.4336796 0.1356258 0.6693227 0.0944018 -0.5550664 -0.7772421 0.2132981 0.0049825 0.0563214 -0.8487266 0.1610904 0.1704895 0.1759609 -0.399858 -0.1488617 0.0877011 -0.005967 0.1796787 -0.3383611 0.1975669 -0.0315714 0.1920288 -0.3627639 -0.3817519 0.0060361 -0.0627763 -0.1229762 -0.3985216 0.0387339 -0.1235629 0.0516167 -0.3516399 -0.265263 0.0327476 -0.050095 -0.0450431 0.1768014 -0.2744784 -0.1282797 -0.1355141 -0.1649366 1.3358935 0.0542082 0.1437485 -0.1818124 0.2040566 0.1374233 0.0697373 0.0605376 0.4731156 -0.5621926 0.203308 0.064188 0.2140869 -0.1350344 -0.0223902 0.138822 -0.0133419 -0.0148345 -0.0135908 0.090568 0.112789 0.0715559 0.1325357 -0.0171216 0.2174023 -0.0469714 0.0166992 2.0285699 -0.3163129 -0.312567 0.1318002 1.0297748 -0.2860735 -0.8811974 -0.3001587 0.5194992 0.040378 -0.1439099 0.0177631 0.0823264 0.0083032 -0.0765633 -0.1096431 -0.0092253 -0.0699637 0.0594842 0.0230022 -0.0984884 -0.1554233 -0.020652 -0.000019 0.0072522 -0.0639723 -0.0718284 -0.0366137 -0.0645055 0.1935553 -0.0223953 0.1937714 -0.1590395 0.0892054 -0.2016226 0.2283694 -0.0273585 0.1249516 -0.1410966 0.1346379 -0.1378883 -0.0595942 -0.1387692 -0.0660755 -0.0571993 -0.2251848 -0.0492794 0.047994 -0.0674098 0.0901448 -0.1211558 0.0714169 -0.1209207 -0.1078023 0.0859286 -0.0761788 -0.06301 -0.066394 0.0145791 -0.0560078 -0.0597112 -0.0532621 -0.0739984 -0.0824331 -0.0142192 -0.0007292 0.0017661 0.0955873 0.0963581 0.0173209 0.0026716 -0.1093461 0.0236669 -0.0227571 -0.0139803 0.0703476 -0.0281511 -0.0541799 -0.0481445 0.0503948 0.1140365 0.3020938 0.0106173 -0.1038885 0.0174179 0.2087978 0.0274333 -0.0890189 0.0406995 0.2169096 0.1652093 -0.0560314 -0.0254134 -0.0661485 0.003295 0.0135047 -0.0203846 0.0356229 0.1327097 0.1394392 0.0438777 -0.0076065 0.0108014 0.021587 0.0722225 0.0001297 0.0603184 0.1160449 0.0711455 -0.0505865 0.0791076 -0.0666676 0.0907729 0.0485267 0.0767256 0.0529869 0.0917739 0.1298327 -0.0656279 -0.0493256 -0.0668892 -0.0011926 0.0069891 -0.0493914 0.0035327 0.1335015 -0.0241749 -0.0400647 0.0972651 -0.0496495 0.0668693 0.0760187 0.1103807 0.0722493 0.0709749 0.0750599 0.0433461 0.0076995 0.0670123 -0.0597069 0.1036564 -0.0029525 0.1071849 0.0937524 -0.0738821 0.09544 0.0417192 0.099716 0.0650379 0.0114732 0.0444215 0.0108578 0.1318505 unknown
polarizability: 177.0680322|-9.9952735|128.4395427|-0.9725159|-19.0899022|97.066662 unknown
InChI: InChI=1S/C11H10N2O2/c14-11(9-4-2-1-3-5-9)15-7-10-6-12-8-13-10/h1-6,8,13H,7H2
charge 0 multiplicity 1
25 atoms
O  0.352034 -0.162691 -1.038681
O  -0.26347 -1.99573 0.273676
N  3.17567 1.007314 -0.131119
N  4.146659 -0.087501 1.591463
C  2.67679 -0.307755 -0.176041
C  1.717128 -0.786618 -1.208789
C  -1.84522 -0.167212 -0.063784
C  3.293193 -0.959145 0.899678
C  -0.545764 -0.880707 -0.228649
C  -2.841767 -0.781601 0.739046
C  -2.104072 1.084855 -0.679894
C  4.047103 1.093514 0.946477
C  -4.087223 -0.147919 0.924767
C  -3.352599 1.714286 -0.491882
C  -4.344896 1.100773 0.309604
H  1.995265 -0.485078 -2.232425
H  1.614087 -1.881693 -1.144969
H  2.904937 1.7650 -0.757538
H  3.163853 -1.992442 1.213188
H  -2.618354 -1.747361 1.204174
H  -1.329657 1.54727 -1.297857
H  4.570494 2.006544 1.220502
H  -4.854598 -0.622553 1.54552
H  -3.554183 2.68015 -0.967725
H  -5.313309 1.592899 0.453957
