program: Gaussian 09
title: 000205630
version: EM64L-G09RevD.01
frameworkgroup: C1[X(C22H32N2O2)]
method: RPBEPBE
basis: SDD
operation: Freq
keyword: #p
keyword: freq=noraman
keyword: PBEPBE/SDD
title: #p freq=noraman PBEPBE/SDD
converged: YES YES NO NO
title: Mulliken charges:
elementType: O O N N C C C C C C C C C C C C C C C C C C C C C C H H H H H H H H H H H H H H H H H H H H H H H H H H H H H H H H
charge: -0.277795 -0.277795 -0.409907 -0.409907 0.429625 0.429625 -0.725854 -0.725853 0.457615 0.457615 -0.561725 -0.553849 -0.553850 -0.561725 -0.095694 -0.095302 -0.095302 -0.095694 -0.529748 -0.533996 -0.533995 -0.529748 -0.459182 -0.459182 -0.075784 -0.075784 0.224772 0.214384 0.224772 0.214383 0.203900 0.213243 0.207539 0.201330 0.207539 0.201330 0.203900 0.213244 0.201748 0.201122 0.201122 0.201748 0.260483 0.193930 0.192515 0.262562 0.192515 0.262562 0.260484 0.193930 0.193008 0.205940 0.193008 0.205940 0.297083 0.297083 0.158038 0.158038
chargesum: 0.00000
title: Mulliken charges with hydrogens summed into heavy atoms:
elementType: O O N N C C C C C C C C C C C C C C C C C C C C C C
charge: -0.277795 -0.277795 -0.112824 -0.112824 0.429625 0.429625 -0.286698 -0.286698 0.457615 0.457615 -0.144582 -0.144980 -0.144980 -0.144582 0.106053 0.105819 0.105819 0.106054 -0.075335 -0.078918 -0.078918 -0.075334 -0.060234 -0.060235 0.082254 0.082254
polarizability: 2.86896548e+02 -3.96028346e-05 2.16341314e+02 3.78152657e+00 4.09373697e-06 1.98501034e+02
1716.lowfreq: -7.4796 0.0004 0.0005 0.0006 17.2311 22.9956 36.3452 60.6602 64.8384
frequency: 35.8362 60.4334 64.8373 81.1263 100.8685 143.1200 145.5985 187.7495 194.8010 196.8034 200.6270 223.6960 244.0872 264.7623 291.8532 296.9428 337.3742 350.3399 387.2362 389.0917 395.4346 397.9416 403.4145 407.1596 411.2508 416.2093 432.2972 445.7234 457.3248 458.5728 464.7765 473.1065 508.6773 509.0936 536.0540 537.2007 641.3614 643.2738 648.7083 678.8339 708.5041 742.8555 773.1709 780.7187 782.7667 816.5130 827.1842 833.6588 840.4756 866.9182 868.7851 875.7627 878.1902 882.6011 887.1443 888.1017 908.7890 927.6791 954.9096 960.5686 960.8932 964.9401 966.4974 971.9154 978.6875 980.3726 981.4974 999.9843 1005.0374 1025.0419 1044.7649 1045.9766 1049.6495 1054.2847 1056.6996 1061.9874 1066.7916 1104.2568 1107.9129 1108.4805 1110.2079 1111.0031 1121.8409 1130.2513 1146.5326 1152.2372 1175.1496 1182.7731 1194.4872 1194.6916 1220.2810 1230.5882 1257.5217 1260.1259 1270.0480 1270.9874 1285.4636 1285.9526 1287.1056 1287.4915 1287.9216 1292.1392 1296.3407 1303.2135 1303.4858 1309.9226 1317.2650 1320.4019 1327.3826 1333.9405 1339.9243 1340.1127 1347.5275 1350.2908 1350.4965 1358.6876 1360.4706 1361.9422 1373.4391 1373.5038 1452.2794 1452.6135 1454.6289 1457.9882 1461.5603 1465.3078 1466.0816 1467.5114 1469.2711 1469.4955 1470.7074 1473.5263 1489.6202 1493.3967 1636.4681 1637.2101 2900.3415 2900.6343 2951.6782 2955.8976 2968.0208 2968.5604 2969.3869 2970.1832 2973.5036 2976.9308 2977.1430 2977.8982 2982.3716 2982.6714 2996.4044 2997.0199 3005.5585 3006.9473 3013.0082 3018.3296 3028.3148 3029.2361 3030.5100 3033.6151 3039.2646 3044.5283 3056.9879 3057.0088 3061.7924 3061.8819 3510.7596 3510.7784
redmass: 4.5814 6.6951 5.3581 5.4834 5.0753 5.3937 4.0665 3.8430 2.4539 2.3299 3.7133 2.6254 3.1261 3.7622 2.1921 2.1461 2.3015 2.4435 2.2245 2.4891 4.4459 4.0455 3.6203 3.5327 2.2268 2.3489 1.9308 2.6780 3.3015 2.7741 2.6559 2.0013 2.4526 2.4461 1.1395 1.1384 4.1040 3.9872 3.9166 4.3524 4.8175 3.6449 3.5546 4.9053 5.2050 3.9440 2.9811 2.7388 2.6558 3.1257 1.5911 1.6355 1.6897 1.6585 1.6227 1.6366 3.3200 2.9852 2.1821 1.6432 1.6633 2.0302 2.1091 2.1498 2.0710 2.1735 2.1302 2.2463 2.2731 2.5211 1.8147 1.8084 1.7472 1.8112 1.9746 1.8855 3.9651 1.0412 1.4701 1.2395 1.1850 1.5058 3.7196 1.1301 1.6733 1.4990 1.1430 1.1202 1.8516 1.7694 2.0288 1.8943 1.9254 1.8409 1.8299 1.8521 1.8136 1.7009 1.8237 1.8670 1.9690 1.5840 1.5489 1.6199 1.7191 1.6425 1.5364 1.5104 1.6118 1.5903 1.4621 1.4550 1.4625 1.5219 1.5135 1.4230 1.5430 1.5396 1.2477 1.2446 1.0834 1.0828 1.0836 1.0807 1.1243 1.4053 1.1846 1.2495 1.1065 1.4281 1.1355 1.1102 1.0916 1.0927 5.4686 5.5304 1.0851 1.0851 1.0586 1.0577 1.0612 1.0645 1.0639 1.0605 1.0622 1.0653 1.0642 1.0629 1.0651 1.0645 1.0822 1.0818 1.0818 1.0813 1.1008 1.1005 1.1020 1.1017 1.1015 1.1018 1.1010 1.0982 1.0993 1.0993 1.0992 1.0991 1.0777 1.0777
irintensity: 0.3760 16.0198 9.0541 0.0003 1.2937 9.9102 11.4094 1.3306 8.0440 19.0102 1.9638 0.1056 9.1203 3.6764 4.9170 10.7887 0.8203 0.5026 5.6395 2.7130 0.1558 0.3462 1.6881 3.1026 0.6881 4.0860 0.3718 2.4385 19.9113 8.1288 9.0976 2.5261 1.7737 6.6046 55.7284 26.8189 2.1096 0.3307 0.9323 0.0096 0.0132 0.0936 1.6952 0.0836 2.8597 2.5400 0.6628 5.5638 1.8057 0.0541 0.1466 0.0142 0.1012 0.0226 0.0226 0.4261 0.8650 2.3782 1.3229 0.7041 0.8363 6.1033 2.1572 3.0094 0.0326 7.0781 1.2959 0.0000 3.0254 1.1441 0.0633 0.2469 0.1867 0.1004 1.3463 0.0009 1.8643 0.4900 5.6233 3.1193 4.2796 0.4988 1.0489 0.4617 2.5871 5.7888 2.3000 0.0030 34.3540 35.1070 1.0497 0.4738 0.1322 1.2861 5.7347 9.4262 2.0816 1.0341 0.6968 3.4139 3.0234 18.8144 0.0146 87.6213 0.0559 5.0369 1.2698 21.9103 19.9837 24.3800 8.3504 7.0998 43.5747 3.5483 14.4995 1.1430 1.3103 0.2226 38.6120 5.4364 1.4520 0.8514 2.7885 0.1593 31.2150 142.0249 2.0532 114.4636 23.9248 63.8320 0.7163 75.3122 0.1043 0.1858 490.1038 0.8346 108.0147 205.2454 22.4298 22.2335 7.0408 29.3871 17.1231 48.3827 55.1132 23.7237 1.6738 15.1270 28.7648 41.9234 70.3150 214.0163 30.7480 44.3904 46.7590 30.8401 12.1542 38.6155 32.6459 59.8167 61.0291 37.5620 9.9902 5.3339 52.5720 5.5864 4.4800 20.5659
temp: 298.150 k
press: 1.00000 atm
elementType: 8 8 7 7 6 6 6 6 6 6 6 6 6 6 6 6 6 6 6 6 6 6 6 6 6 6 1 1 1 1 1 1 1 1 1 1 1 1 1 1 1 1 1 1 1 1 1 1 1 1 1 1 1 1 1 1 1 1
symmnumber: 1
zpe: 1335047.7 jmol-1
zpe.correction: 0.508493 hartree
zpe.thermalcorrener: 0.529990 hartree
zpe.thermalcorrenthalpy: 0.530934 hartree
zpe.thermalcorrgfe: 0.460548 hartree
zpe.sumelectzpe: -1115.547749 hartree
zpe.sumelectthermal: -1115.526252 hartree
zpe.sumelectthermalent: -1115.525308 hartree
zpe.sumelectthermalfe: -1115.595694 hartree
dipole: 0.0000 0.3324 0.0000
dipole: 0.3324
quadrupole: -228.9602 -145.0482 -149.2028
quadrupole: 0.0001 -5.5063 0.0000
quadrupole: -54.5564 29.3555 25.2009 0.0001 -5.5063 0.0000
hfenergy: -1116.056242 hartree
pointgroup: C01 [X(C22H32N2O2)]
dipole: 0.0000021 -0.1307916 0.000004 debye
polarizability: 286.9435622|0.0000702|216.3413144|-3.1846295|0.0000015|198.45402 unknown
InChI: InChI=1S/C22H32N2O2/c25-13-23-21-7-15-1-16(8-21)4-19(3-15,11-21)20-5-17-2-18(6-20)10-22(9-17,12-20)24-14-26/h13-18,23-24H,1-12H2
charge 0 multiplicity 1
58 atoms
O  5.86139 -1.615527 0.411474
O  -5.861384 -1.615538 -0.41148
N  3.589681 -1.838902 0.988093
N  -3.589673 -1.838913 -0.988089
C  0.788114 0.566824 -0.147269
C  -0.788112 0.566821 0.147271
C  1.496949 -0.634668 0.558781
C  -1.496944 -0.634673 -0.55878
C  3.026837 -0.652248 0.281223
C  -3.026831 -0.652259 -0.281219
C  1.463939 1.87823 0.373084
C  1.095483 0.459092 -1.67807
C  -1.095478 0.459087 1.678072
C  -1.463943 1.878226 -0.37308
C  2.993839 1.870011 0.112648
C  2.624234 0.467576 -1.950027
C  -2.624228 0.467565 1.950031
C  -2.993843 1.870001 -0.112642
C  3.65205 0.66281 0.826612
C  3.279638 -0.749806 -1.249291
C  -3.27963 -0.749819 1.249296
C  -3.65205 0.662798 -0.826605
C  3.254358 1.777519 -1.412797
C  -3.254358 1.777506 1.412803
C  4.915573 -2.213884 1.000957
C  -4.915564 -2.213898 -1.000955
H  1.346666 -0.569335 1.654386
H  1.056215 -1.59353 0.214694
H  -1.346663 -0.569339 -1.654384
H  -1.056206 -1.593534 -0.214694
H  1.275092 2.002279 1.457695
H  1.025449 2.756139 -0.137177
H  0.619371 1.298531 -2.221658
H  0.675023 -0.478614 -2.090313
H  -0.619368 1.298527 2.221659
H  -0.675013 -0.478618 2.090313
H  -1.275098 2.002276 -1.457691
H  -1.025455 2.756135 0.137181
H  3.431439 2.807232 0.509496
H  2.795879 0.391355 -3.0419
H  -2.795871 0.391342 3.041904
H  -3.431446 2.807221 -0.509488
H  4.742852 0.648156 0.654221
H  3.484265 0.720893 1.920601
H  2.84772 -1.695732 -1.633156
H  4.367571 -0.777645 -1.437596
H  -2.847708 -1.695744 1.633159
H  -4.367562 -0.777662 1.437602
H  -4.742852 0.64814 -0.654213
H  -3.484267 0.720882 -1.920595
H  2.813045 2.653581 -1.92884
H  4.342842 1.787569 -1.616542
H  -2.813047 2.653569 1.928846
H  -4.342842 1.787551 1.61655
H  2.936138 -2.420281 1.520222
H  -2.936128 -2.420291 -1.520219
H  5.078449 -3.137237 1.608172
H  -5.078438 -3.137247 -1.608177
