program: Gaussian 09
title: 000205601
version: EM64L-G09RevD.01
frameworkgroup: C1[X(C14H21NO)]
method: RPBEPBE
basis: SDD
operation: Freq
keyword: #p
keyword: freq=noraman
keyword: PBEPBE/SDD
title: #p freq=noraman PBEPBE/SDD
converged: YES YES NO NO
title: Mulliken charges:
elementType: O N C C C C C C C C C C C C C C H H H H H H H H H H H H H H H H H H H H H
charge: -0.220028 -0.314469 -0.185649 -0.402979 -0.353361 0.077657 -0.325015 0.307180 -0.698296 -0.334465 -0.357684 -0.689322 0.439197 -0.406692 -0.386916 -0.807450 0.208702 0.218891 0.192427 0.183959 0.227092 0.260104 0.191130 0.200174 0.217593 0.215139 0.204256 0.256847 0.272079 0.231962 0.207985 0.212734 0.230260 0.232603 0.227960 0.239627 0.226770
chargesum: 0.00000
title: Mulliken charges with hydrogens summed into heavy atoms:
elementType: O N C C C C C C C C C C C C C C
charge: -0.220028 -0.054365 0.023052 0.008340 0.057690 0.077657 0.066289 0.307180 -0.061309 -0.077618 -0.085605 -0.036642 0.439197 -0.176432 -0.154314 -0.113093
polarizability: 2.23868728e+02 2.28800892e+00 1.55917458e+02 9.95744452e+00 -1.98392891e+01 1.23335229e+02
1716.lowfreq: -15.7845 -13.7270 -0.9324 -0.0006 0.0004 0.0007 3.6605 18.1925 30.9788
frequency: -15.5950 16.7843 30.7753 54.5731 59.3725 68.7732 75.4041 97.6771 118.7275 144.4659 189.4042 226.6526 246.9139 253.2762 258.1628 273.2798 314.6096 325.6024 346.1282 400.4439 405.5199 450.2997 493.7843 514.7816 585.4429 621.0672 634.0148 687.6188 702.8761 736.6649 764.2052 796.0254 806.9188 832.4684 855.7907 886.8920 891.4748 923.4599 950.0318 963.7302 987.5823 993.9055 1012.3254 1025.8724 1042.1771 1046.2989 1068.2753 1098.7240 1099.9567 1108.1127 1123.7117 1142.6546 1155.5739 1190.1246 1215.3230 1225.0331 1239.7054 1252.6718 1268.7433 1291.7633 1306.3062 1311.5196 1342.0427 1349.1581 1362.2630 1372.9793 1388.4879 1391.9912 1396.7572 1409.9886 1446.2731 1448.0163 1468.6528 1471.3642 1472.1381 1472.6576 1476.5589 1481.8819 1484.3330 1497.7900 1501.8352 1557.3702 1589.1172 1619.5004 2879.5258 2965.4854 2972.0080 2975.1369 2976.4558 2980.4004 2984.4981 2988.1023 3019.5644 3045.6131 3056.9332 3069.1607 3072.9186 3073.2715 3087.5721 3093.1922 3123.0148 3125.3122 3155.7861 3165.0144 3450.3394
redmass: 1.0163 4.3947 3.6103 3.1198 2.9652 1.7331 1.7573 4.9565 4.0563 3.5477 2.5825 1.2136 3.4176 2.1526 1.5426 2.7324 3.0783 4.2649 3.4818 2.8073 3.3688 3.5719 2.9425 3.1765 3.2357 2.0742 6.4112 2.9794 1.8529 2.2343 1.6729 3.3638 1.1240 1.5742 1.2979 1.5862 1.9148 1.5984 2.9965 1.5295 1.4134 1.3851 2.9733 2.7779 2.6848 1.5877 2.0107 2.1106 2.0391 1.7716 1.3059 2.7599 2.2950 1.1690 1.8153 2.6875 1.4952 1.4594 1.2544 1.2029 1.2974 1.3561 1.5078 1.5067 1.3162 4.6285 1.2128 1.2446 1.2235 3.5506 1.1575 1.1147 1.1045 1.0611 1.0595 1.0567 1.0457 1.0489 1.0701 1.0907 2.6004 6.6844 7.4278 6.4426 1.0701 1.0604 1.0380 1.0391 1.0608 1.0415 1.0824 1.0836 1.0948 1.1020 1.0942 1.1001 1.0988 1.0999 1.1000 1.1004 1.0891 1.0893 1.0947 1.0946 1.0745
irintensity: 0.6830 1.4256 0.1171 0.0962 0.4363 1.7326 0.0355 0.8987 1.3680 0.6035 1.7148 0.7535 3.0816 1.6600 2.4569 2.3942 1.1405 0.3960 4.4868 0.2544 3.6131 9.6161 12.3879 4.9181 60.4309 80.5205 3.1743 13.3903 8.7991 14.2979 9.3378 3.9112 4.8833 29.6338 12.9365 4.2926 25.4752 4.2098 43.0648 8.1048 2.4177 3.7137 0.4164 0.8286 4.0160 22.9730 1.6771 18.3918 1.5194 19.5759 10.7722 39.7784 36.0152 48.1067 39.6871 0.2162 29.7720 52.4626 1.7234 14.1323 0.1299 10.6457 16.2070 6.9623 8.4800 13.2528 8.8515 23.2504 13.1983 8.3095 9.1513 34.8654 13.6768 3.5206 6.1045 12.3676 11.7383 4.4798 12.1807 5.7189 0.5680 108.9023 76.6795 44.7431 116.0000 21.8336 34.8912 32.9960 47.7323 26.9989 5.0374 62.5778 6.8566 12.9476 21.7702 66.3613 21.2287 83.3270 16.5508 38.6495 16.5869 18.6245 12.5875 6.2402 0.8195
temp: 298.150 k
press: 1.00000 atm
elementType: 8 7 6 6 6 6 6 6 6 6 6 6 6 6 6 6 1 1 1 1 1 1 1 1 1 1 1 1 1 1 1 1 1 1 1 1 1
symmnumber: 1
zpe: 834221.3 jmol-1
zpe.correction: 0.317738 hartree
zpe.thermalcorrener: 0.335186 hartree
zpe.thermalcorrenthalpy: 0.336130 hartree
zpe.thermalcorrgfe: 0.270147 hartree
zpe.sumelectzpe: -674.827943 hartree
zpe.sumelectthermal: -674.810495 hartree
zpe.sumelectthermalent: -674.809551 hartree
zpe.sumelectthermalfe: -674.875534 hartree
dipole: -1.0314 2.0918 -2.1531
dipole: 3.1742
quadrupole: -83.5471 -96.9362 -100.2587
quadrupole: 4.9858 0.0853 0.0014
quadrupole: 10.0336 -3.3555 -6.6780 4.9858 0.0853 0.0014
hfenergy: -675.145681 hartree
pointgroup: C01 [X(C14H21N1O1)]
dipole: -0.3959314 0.3830011 -1.1207589 debye
polarizability: 224.3527424|-5.1501827|132.3604346|2.4448666|-25.3100047|146.4082382 unknown
InChI: InChI=1S/C14H21NO/c1-4-6-13(15-5-2)14(16)12-9-7-11(3)8-10-12/h7-10,13,15H,4-6H2,1-3H3
charge 0 multiplicity 1
37 atoms
O  0.664684 -0.637781 2.079307
N  1.607143 1.324312 -0.316259
C  1.44226 -0.145916 -0.185363
C  2.73247 -0.929241 0.163723
C  2.585878 -2.46088 0.010666
C  0.337918 -0.344563 0.889262
C  2.265787 1.824438 -1.541127
C  -1.099895 -0.158935 0.512613
C  3.896267 -3.213743 0.326164
C  -1.509837 0.360249 -0.744742
C  -2.099639 -0.531312 1.452441
C  2.30643 3.362553 -1.544311
C  -3.880794 0.117324 -0.117089
C  -2.878529 0.494223 -1.050448
C  -3.465023 -0.39999 1.139517
C  -5.353015 0.289616 -0.441515
H  1.056991 -0.511942 -1.158636
H  3.013788 -0.69441 1.208663
H  3.551578 -0.572451 -0.493619
H  2.261183 -2.699737 -1.023839
H  1.786002 -2.819015 0.687073
H  1.989563 1.744087 0.541618
H  3.302198 1.428573 -1.674636
H  1.679752 1.467762 -2.412538
H  4.222885 -3.01362 1.363694
H  3.772134 -4.30685 0.215853
H  4.712088 -2.895429 -0.350698
H  -0.757857 0.691053 -1.467078
H  -1.775028 -0.926395 2.421052
H  1.285599 3.77488 -1.462451
H  2.900005 3.746261 -0.692474
H  2.769945 3.740658 -2.473308
H  -3.179309 0.901404 -2.023443
H  -4.222474 -0.702008 1.873116
H  -5.971154 -0.476184 0.059188
H  -5.717944 1.278628 -0.101132
H  -5.539953 0.227776 -1.527846
