program: Gaussian 09
title: 000213609
version: EM64L-G09RevD.01
frameworkgroup: C1[X(C13H16N3O3)]
method: RPBEPBE
basis: SDD
operation: Freq
keyword: #p
keyword: freq=noraman
keyword: PBEPBE/SDD
title: #p freq=noraman PBEPBE/SDD
converged: YES YES NO NO
title: Mulliken charges:
elementType: O O O N N N C C C C C C C C C C C C C H H H H H H H H H H H H H H H H
charge: -0.220390 -0.152134 -0.140076 -0.091112 -0.222533 -0.135882 -0.354061 -0.357924 -0.496070 -0.290781 -0.304225 0.260666 0.145170 0.403964 -0.356993 -0.355914 -0.193697 -0.182354 -0.209356 0.271116 0.223094 0.259297 0.264704 0.295058 0.284589 0.197171 0.250090 0.253574 0.217461 0.362773 0.275545 0.291180 0.267752 0.269149 0.271146
chargesum: 1.00000
title: Mulliken charges with hydrogens summed into heavy atoms:
elementType: O O O N N N C C C C C C C C C C C C C
charge: -0.220390 -0.152134 -0.140076 -0.091112 -0.222533 0.226891 0.140149 0.166077 0.083577 0.156481 0.166810 0.260666 0.145170 0.403964 -0.081448 -0.064734 0.074055 0.086795 0.061790
polarizability: 2.85542082e+02 -1.22832860e-01 1.67066522e+02 -1.40563759e+01 -2.83424690e+00 1.51202742e+02
1716.lowfreq: -18.4461 -9.5261 -0.0004 0.0002 0.0003 3.4338 22.6884 23.4521 52.4103
frequency: 20.2667 22.8256 52.3680 60.0371 83.2721 96.3521 120.0283 171.6824 183.6031 233.3175 251.5520 261.4162 309.7256 329.2572 340.5791 372.4478 378.3481 403.5632 418.2283 456.9121 464.9392 520.2928 539.4594 575.9049 599.1040 610.3313 650.4601 669.2421 673.0077 686.8010 715.5709 730.1391 771.8851 802.0256 826.3780 833.7723 847.1032 887.3294 902.1917 937.9933 943.8434 968.0198 983.8396 984.6757 989.9000 1002.8373 1017.1402 1021.5506 1038.8689 1068.6604 1084.7757 1089.4705 1096.3676 1138.5649 1160.7137 1184.0470 1187.8174 1189.0823 1201.3542 1232.1265 1267.9736 1285.0575 1306.0566 1315.4058 1322.7165 1326.7144 1332.7249 1338.2228 1352.1305 1358.8080 1376.1091 1389.4320 1439.1226 1445.5704 1447.0113 1449.5450 1450.8403 1456.0526 1466.2380 1522.1114 1587.5582 1592.9277 1737.8075 2946.5814 2953.5754 2958.2405 2980.3997 3016.6566 3051.1431 3079.8756 3090.4065 3100.6849 3111.7644 3149.0962 3156.0650 3164.7733 3175.1355 3187.8593 3307.4303
redmass: 5.2702 4.9474 3.4610 4.3865 5.9318 4.5711 5.7015 6.7408 3.9127 1.9418 4.4665 3.3623 7.4061 4.5124 6.5843 2.1248 2.1846 2.9172 5.0712 3.3201 3.6026 6.5520 4.7046 1.9891 5.7855 6.4756 6.0028 7.8587 10.1103 2.6451 3.3599 3.5831 1.5015 3.9301 1.6362 3.8307 1.2566 2.7719 5.2835 1.3365 8.0859 2.2849 2.7914 3.5465 1.6369 2.3998 1.3510 2.1237 1.9416 4.9485 1.7659 1.9981 1.8939 2.0416 2.0276 1.3568 1.0577 1.0729 2.0534 1.3701 1.2649 1.6156 1.6269 1.4339 1.2511 1.3861 1.5318 1.2131 1.5049 1.4493 1.3990 9.6017 1.0877 1.7610 1.2348 1.0902 1.0987 1.0926 2.1153 5.6489 6.2550 5.9900 12.5329 1.0693 1.0670 1.0642 1.0668 1.0615 1.0967 1.0962 1.1043 1.0957 1.0982 1.0899 1.0891 1.0924 1.0968 1.1017 1.0791
irintensity: 0.4353 1.4223 0.2034 0.3672 2.3850 2.7260 1.8498 0.4667 1.5418 0.3592 11.8626 11.1833 1.4350 19.3133 10.3777 1.7913 0.8811 0.5340 11.3203 5.3394 6.8962 12.7476 2.0438 39.9874 52.5187 7.6197 15.3095 46.2545 10.4831 9.5313 66.6817 3.0268 69.0503 5.7620 0.4347 3.2231 3.2754 7.0732 102.9735 1.3739 40.4543 2.4053 70.4904 5.0139 1.1101 8.7398 0.0559 3.3434 12.8631 48.0276 0.8244 24.1713 7.3208 57.7309 20.5804 14.4383 0.0750 1.2976 4.5766 5.5074 1.0428 18.4025 12.4590 7.8933 8.6163 11.1392 43.8967 4.7290 2.7282 3.3542 16.6873 3.1396 15.9447 30.6458 6.4744 4.0639 21.7816 19.0603 13.4509 106.8017 4.3965 16.5386 272.7964 18.6271 12.9005 37.7893 37.9580 11.7655 12.2261 2.4982 0.8325 14.2792 15.3323 1.1415 1.1792 1.3578 0.6492 2.2906 51.8176
temp: 298.150 k
press: 1.00000 atm
elementType: 8 8 8 7 7 7 6 6 6 6 6 6 6 6 6 6 6 6 6 1 1 1 1 1 1 1 1 1 1 1 1 1 1 1 1
symmnumber: 1
zpe: 732049.9 jmol-1
zpe.correction: 0.278823 hartree
zpe.thermalcorrener: 0.295775 hartree
zpe.thermalcorrenthalpy: 0.296719 hartree
zpe.thermalcorrgfe: 0.232233 hartree
zpe.sumelectzpe: -893.136972 hartree
zpe.sumelectthermal: -893.120021 hartree
zpe.sumelectthermalent: -893.119076 hartree
zpe.sumelectthermalfe: -893.183563 hartree
dipole: 6.7400 -1.1537 2.2465
dipole: 7.1975
quadrupole: -72.5360 -104.3937 -94.0034
quadrupole: -1.5992 -7.2782 -1.4054
quadrupole: 17.7750 -14.0827 -3.6924 -1.5992 -7.2782 -1.4054
hfenergy: -893.4157955 hartree
pointgroup: C01 [X(C13H16N3O3)]
dipole: -2.6355749 -0.9686645 -0.366237 debye
polarizability: 283.7831542|-1.1630424|165.1724833|-20.6075152|-5.9945441|154.8557093 unknown
InChI: InChI=1S/C13H16N3O3/c17-13-12(10-15-6-8-18-9-7-15)16(14-19-13)11-4-2-1-3-5-11/h1-5,14H,6-10H2
charge 1 multiplicity 1
35 atoms
O  3.917349 -1.063976 1.35758
O  0.363189 2.79251 -0.459978
O  2.049572 1.997064 -1.924433
N  1.817975 -0.986499 -0.575893
N  -0.877759 0.837632 -0.376634
N  -0.753009 2.153037 0.242144
C  1.580771 -1.597465 0.752077
C  3.231101 -0.921433 -1.019813
C  0.719414 -0.827435 -1.515975
C  2.525137 -0.971942 1.803232
C  4.110122 -0.324843 0.101521
C  0.19559 0.547854 -1.136598
C  1.02245 1.760558 -1.289782
C  -2.016735 0.041546 -0.009936
C  -2.637292 -0.76534 -0.998069
C  -2.504186 0.107258 1.320533
C  -3.758113 -1.537469 -0.630877
C  -3.63515 -0.662311 1.660892
C  -4.258022 -1.487213 0.692826
H  1.781025 -2.688706 0.689942
H  0.524875 -1.458875 1.048748
H  3.305286 -0.302092 -1.929486
H  3.584952 -1.948959 -1.252353
H  1.075633 -0.827077 -2.559364
H  -0.052011 -1.610432 -1.409983
H  2.247307 0.089898 1.982516
H  2.474551 -1.530216 2.751052
H  5.176949 -0.428672 -0.147536
H  3.868605 0.748185 0.248226
H  -1.603084 2.722067 0.036537
H  -2.288119 -0.749938 -2.036074
H  -1.997684 0.726059 2.0683
H  -4.253856 -2.159673 -1.381878
H  -4.023543 -0.626719 2.683002
H  -5.134391 -2.082383 0.966638
