program: Gaussian 09
title: 000205594
version: EM64L-G09RevD.01
frameworkgroup: C1[X(C21H20N2O3)]
method: RPBEPBE
basis: SDD
operation: Freq
keyword: #p
keyword: freq=noraman
keyword: PBEPBE/SDD
title: #p freq=noraman PBEPBE/SDD
converged: YES YES NO NO
title: Mulliken charges:
elementType: O O O N N C C C C C C C C C C C C C C C C C C C C C H H H H H H H H H H H H H H H H H H H H
charge: -0.481680 -0.304356 -0.245955 -0.090575 -0.403048 0.173859 -0.453598 -0.459865 -0.453052 -0.446006 0.408929 0.143379 -0.398907 -0.409165 -0.024073 -0.254533 -0.216322 0.238927 -0.242958 0.150892 0.221101 -0.322977 -0.376691 -0.349927 -0.242862 -0.210505 0.241187 0.224413 0.220136 0.243664 0.278777 0.219796 0.209597 0.287227 0.334701 0.221937 0.291835 0.223505 0.224601 0.227204 0.312182 0.317666 0.285760 0.233178 0.226495 0.226108
chargesum: 0.00000
title: Mulliken charges with hydrogens summed into heavy atoms:
elementType: O O O N N C C C C C C C C C C C C C C C C C C C C C
charge: -0.146979 -0.304356 -0.245955 -0.090575 -0.085382 0.173859 0.012002 0.003935 0.045521 0.050817 0.408929 0.143379 -0.176969 -0.117330 -0.024073 -0.031028 0.008279 0.238927 -0.015753 0.150892 0.221101 -0.010795 -0.090931 -0.116749 -0.016368 0.015603
polarizability: 3.50552341e+02 3.34323721e+01 2.02750744e+02 2.19670424e+00 1.99180107e+01 2.13041231e+02
1716.lowfreq: -10.6138 0.0006 0.0009 0.0009 2.4091 6.3317 12.5019 21.6796 25.3488
frequency: 11.6752 21.3459 25.2842 37.5655 55.4994 98.4841 110.7761 118.1321 120.9233 146.9680 158.5398 179.8044 218.2336 225.8286 251.7501 262.2115 268.6476 291.7561 336.6603 352.7316 367.2877 385.8400 404.0661 408.2763 423.4163 425.1803 458.0128 470.2628 484.3203 514.0484 537.5213 543.2647 574.3091 590.5601 614.7513 617.7461 626.7454 638.0292 655.1990 683.4117 696.4858 706.4177 748.3657 759.3554 763.7913 765.8220 778.5219 785.7380 801.2203 855.7583 860.9086 867.5291 869.2599 875.6277 904.8403 920.5413 940.1557 948.2369 963.7175 978.9156 989.4301 989.7807 990.4955 1000.9854 1001.7865 1010.7159 1030.8722 1043.2227 1075.8933 1086.3119 1109.2921 1120.8339 1129.8793 1143.2785 1148.3901 1162.5717 1166.9150 1172.1275 1191.3018 1201.3143 1213.4997 1241.7370 1247.0482 1257.1148 1264.1792 1289.9998 1294.1906 1315.4814 1320.2608 1331.6069 1348.0769 1355.7537 1362.5381 1381.4967 1391.0598 1408.1856 1426.8432 1433.5386 1436.6117 1447.0703 1450.1263 1471.5345 1482.2974 1482.9490 1485.4524 1504.0246 1544.4728 1551.7574 1590.8032 1591.1876 1613.9439 1631.8265 2942.2646 2945.9559 3005.3818 3009.4176 3069.6919 3074.1066 3086.0700 3112.8747 3126.1199 3127.2109 3129.8351 3139.4025 3142.1075 3158.4859 3161.0349 3183.5602 3184.9810 3248.7928 3567.9739 3594.8280
redmass: 6.2150 3.9968 4.7032 6.2242 6.8391 4.4613 4.5205 5.4030 5.4114 1.8901 1.6554 5.5468 4.6365 4.2800 3.9786 4.0072 5.3252 4.8483 3.7629 4.0513 2.8738 3.0847 2.8670 3.2361 4.1691 3.2890 3.0689 5.3000 3.4745 5.3680 3.2373 6.6569 3.8838 2.0023 3.3183 5.8620 3.8269 2.5796 2.8937 6.7259 3.8534 1.7660 3.4403 1.5347 4.2652 2.1659 4.2847 1.5862 4.9698 1.2481 1.6488 2.2941 1.9223 3.4051 3.4166 1.5152 3.1044 1.3765 2.2986 1.3750 4.1918 1.3280 2.0796 1.3611 2.2784 2.0871 2.1615 2.3113 1.7898 2.1916 1.9205 2.4693 1.8189 1.6719 1.6850 1.7100 1.1369 1.0600 1.1481 1.8016 1.7861 1.6472 2.5654 1.5170 1.5038 1.9074 2.1810 1.3422 1.3608 1.2874 1.5183 2.2459 1.7887 8.5074 4.8240 2.9326 2.5731 2.2163 1.0920 1.1032 3.6632 1.1100 2.8660 2.2324 1.1230 6.7655 7.1388 8.6660 6.2064 6.6399 6.1338 7.1543 1.0721 1.0716 1.0598 1.0606 1.1021 1.1018 1.0920 1.0864 1.0871 1.0893 1.0859 1.0935 1.0914 1.0993 1.0976 1.0946 1.0964 1.0995 1.0656 1.0810
irintensity: 1.0016 1.3287 0.3636 3.0567 1.8715 0.7494 0.3249 0.3142 1.5248 76.5041 43.4537 1.6296 11.8844 8.8905 5.6801 1.9309 0.4423 0.4877 5.7318 6.7972 15.4259 6.6084 0.0671 0.0838 0.5287 14.3342 1.9399 1.6238 4.2837 14.8579 11.7293 6.2466 0.1240 34.9786 47.3639 5.9162 50.9016 13.4375 1.9303 2.9272 2.3037 51.0535 25.7905 97.7698 4.6088 53.5451 64.2805 1.1184 26.3531 0.6016 9.0672 8.5934 3.1909 28.2477 64.1386 4.8929 35.2229 4.8462 4.1586 0.0403 1.0593 0.5566 7.0620 3.8522 30.4815 11.4205 6.4142 2.5442 18.2506 14.4806 59.3237 88.0566 73.8515 26.7517 56.6467 5.0484 18.5038 1.5335 2.8859 16.3216 127.9932 11.8728 45.1302 5.0796 36.7907 3.3338 0.3531 3.7969 0.2091 3.2743 6.3081 8.9425 75.6411 3.4418 68.1965 55.6300 58.0544 15.5160 8.8903 10.7265 35.6255 35.4008 4.3661 28.4609 19.9727 13.3041 418.9378 284.9539 0.4264 3.1061 8.1722 3.1934 11.9252 100.1649 17.0650 16.2597 13.2843 31.8483 6.8201 16.3282 2.8341 7.1930 0.2058 38.6761 18.3743 29.7559 29.5660 5.8794 6.9792 14.7849 1.6403 79.0729
temp: 298.150 k
press: 1.00000 atm
elementType: 8 8 8 7 7 6 6 6 6 6 6 6 6 6 6 6 6 6 6 6 6 6 6 6 6 6 1 1 1 1 1 1 1 1 1 1 1 1 1 1 1 1 1 1 1 1
symmnumber: 1
zpe: 959694.8 jmol-1
zpe.correction: 0.365528 hartree
zpe.thermalcorrener: 0.387683 hartree
zpe.thermalcorrenthalpy: 0.388628 hartree
zpe.thermalcorrgfe: 0.311760 hartree
zpe.sumelectzpe: -1145.582878 hartree
zpe.sumelectthermal: -1145.560724 hartree
zpe.sumelectthermalent: -1145.559779 hartree
zpe.sumelectthermalfe: -1145.636647 hartree
dipole: 1.5291 3.1974 2.0776
dipole: 4.1083
quadrupole: -138.7639 -148.4948 -145.5797
quadrupole: 14.2299 9.8997 9.4402
quadrupole: 5.5156 -4.2153 -1.3003 14.2299 9.8997 9.4402
hfenergy: -1145.9484069 hartree
pointgroup: C01 [X(C21H20N2O3)]
dipole: 0.4447174 1.1204344 1.0767173 debye
polarizability: 344.4503691|37.7518727|199.5406408|19.7109668|21.0826628|222.3533062 unknown
InChI: InChI=1S/C21H20N2O3/c24-19(17-14-22-18-9-5-4-8-16(17)18)20(25)23-12-10-21(26,11-13-23)15-6-2-1-3-7-15/h1-9,14,22,26H,10-13H2
charge 0 multiplicity 1
46 atoms
O  -3.77235 -1.732073 -1.628457
O  0.863222 -1.995047 1.723845
O  2.142526 -1.063491 -1.421388
N  -0.461224 -1.587842 -0.147973
N  3.969739 0.777531 2.445766
C  -3.236057 -0.697053 -0.710259
C  -2.825064 -1.366252 0.635202
C  -1.987462 -0.029716 -1.358366
C  -1.603096 -2.295786 0.480638
C  -0.776776 -0.987499 -1.465609
C  -4.367038 0.317418 -0.503944
C  0.73779 -1.522592 0.542041
C  -4.170239 1.437634 0.345321
C  -5.618184 0.161826 -1.149096
C  1.969474 -0.900515 -0.165278
C  -5.200787 2.381673 0.545303
C  -6.650431 1.106914 -0.948465
C  2.927078 -0.179143 0.661057
C  -6.44796 2.220091 -0.101953
C  4.118787 0.519661 0.176499
C  4.750978 1.114457 1.318654
C  2.887755 0.009298 2.059923
C  4.703279 0.69558 -1.102909
C  5.933608 1.87566 1.23055
C  5.887227 1.456361 -1.202421
C  6.495346 2.039491 -0.053809
H  -3.686087 -1.943995 1.017736
H  -2.588402 -0.584834 1.380066
H  -1.693751 0.852936 -0.761241
H  -2.26229 0.327498 -2.367882
H  -1.265854 -2.669384 1.460427
H  -1.858002 -3.177653 -0.14658
H  -0.987611 -1.808589 -2.185425
H  0.102171 -0.461696 -1.85876
H  -3.050181 -2.373833 -1.844535
H  -3.210948 1.583434 0.85779
H  -5.765618 -0.701718 -1.801826
H  -5.031071 3.240952 1.20404
H  -7.613303 0.972266 -1.454641
H  -7.248862 2.951977 0.052475
H  2.17131 -0.39649 2.769776
H  4.182821 1.043982 3.405848
H  4.23809 0.23854 -1.9796
H  6.403389 2.322316 2.113683
H  6.354192 1.600922 -2.182862
H  7.41557 2.622782 -0.168261
