program: Gaussian 09
title: 000213628
version: EM64L-G09RevD.01
frameworkgroup: C1[X(C23H27N3O)]
method: RPBEPBE
basis: SDD
operation: Freq
keyword: #p
keyword: freq=noraman
keyword: PBEPBE/SDD
title: #p freq=noraman PBEPBE/SDD
converged: NO YES NO NO
title: Mulliken charges:
elementType: O N N N C C C C C C C C C C C C C C C C C C C C C C C H H H H H H H H H H H H H H H H H H H H H H H H H H H
charge: -0.276595 -0.058649 -0.406670 -0.407674 -0.050754 -0.431504 -0.463481 -0.368011 -0.390041 -0.347844 -0.570358 0.410300 0.132532 0.107537 -0.448018 0.224596 0.151015 -0.411315 -0.352930 0.312177 -0.259558 -0.385366 -0.218249 -0.411172 -0.796969 -0.249971 -0.222849 0.269126 0.211103 0.234940 0.211415 0.217925 0.176277 0.213842 0.224667 0.154337 0.199857 0.215951 0.212624 0.224145 0.310822 0.269363 0.303413 0.230578 0.225944 0.219200 0.241552 0.220720 0.233291 0.270595 0.209554 0.229054 0.230520 0.229005
chargesum: 0.00000
title: Mulliken charges with hydrogens summed into heavy atoms:
elementType: O N N N C C C C C C C C C C C C C C C C C C C C C C C
charge: -0.276595 -0.058649 -0.095847 -0.104262 0.218372 0.014539 -0.034140 0.022107 -0.011037 0.067964 -0.133589 0.410300 0.132532 0.107537 -0.178655 0.224596 0.151015 -0.180737 -0.126986 0.312177 -0.040358 -0.143814 0.002471 -0.177881 -0.087766 -0.019451 0.006157
polarizability: 3.32735722e+02 -7.24478356e-01 3.05556494e+02 -2.13833563e+01 -2.29886150e-01 1.70506055e+02
1716.lowfreq: -10.7987 -3.2424 0.0001 0.0005 0.0008 1.8419 9.1410 10.9420 13.5051
frequency: 9.0458 9.3266 12.9668 26.3217 50.3886 52.3243 65.4720 78.4220 102.2866 113.3678 132.4013 149.3953 167.9141 208.1379 216.8464 219.1752 221.9836 241.3224 260.4021 280.5297 321.1497 344.0748 370.5197 383.8750 388.5480 405.4865 423.0366 427.5744 456.4222 465.4568 482.8063 502.0463 511.2675 521.1808 538.7495 541.4029 556.8590 575.7420 584.5692 632.2818 650.6703 666.5032 700.7188 723.5410 742.5442 745.3550 747.2528 758.2497 766.4819 777.9784 782.6975 785.5343 801.1081 807.4433 830.2952 849.2221 867.0794 877.0193 882.4898 904.1915 929.8743 947.4921 960.9414 968.6396 989.4535 991.2273 993.3954 1003.4200 1009.4562 1012.9790 1036.3033 1047.3107 1049.0132 1054.1688 1067.4513 1088.9870 1089.6692 1096.2213 1111.9296 1132.3389 1134.2500 1137.9903 1151.9254 1164.3592 1172.9655 1176.2903 1184.1116 1210.5051 1228.5808 1239.7716 1248.0434 1253.7088 1259.6765 1283.1176 1284.2836 1287.2705 1293.9552 1306.5707 1307.8953 1332.8582 1340.4404 1345.5471 1348.8537 1359.4088 1369.8373 1372.2938 1390.0764 1392.1050 1404.0785 1420.5288 1423.5947 1444.2742 1452.5765 1454.2410 1457.1259 1459.3522 1462.9394 1470.4255 1473.1616 1474.7293 1482.2291 1482.7996 1487.1602 1564.2154 1571.4792 1586.9299 1591.4761 1610.8487 1631.3438 2776.3214 2816.2777 2863.7373 2983.6548 2989.2048 2996.4851 3002.4574 3020.3277 3024.7391 3030.2891 3047.3821 3054.2352 3062.6946 3072.1517 3073.7343 3093.7137 3115.8748 3120.5543 3123.8454 3128.0494 3140.5293 3142.2214 3160.8337 3161.4026 3218.8818 3543.4246 3613.8240
redmass: 5.0050 4.7641 4.4149 4.6781 4.4097 5.2592 3.5316 4.0738 3.0988 1.1814 4.2336 3.2303 3.3459 3.2309 3.2153 3.2640 3.0239 3.5636 3.7026 3.2316 4.5196 2.4575 4.3741 2.3297 2.8717 3.1153 2.8458 2.8627 3.4178 2.9168 3.3438 1.3068 2.5769 3.9354 2.9586 1.5934 4.7147 3.0777 4.3341 3.3241 5.6839 2.5117 4.9845 4.0407 1.6063 2.9550 1.3570 3.6180 4.5184 2.1744 1.6059 2.3313 1.5906 1.9168 3.9924 1.4955 5.1270 1.4187 2.8108 2.4907 1.3822 1.6463 1.9566 1.2976 2.5257 1.3354 1.6141 1.6704 1.8423 2.0715 3.4166 1.7327 2.0088 2.1891 2.9601 2.2787 1.9988 1.4768 2.3886 1.4804 2.4360 2.0192 2.1505 1.1488 1.1743 1.0650 1.1887 2.5027 1.7000 2.3344 1.5921 1.4429 1.5316 1.4626 1.4867 1.3021 1.5311 1.7163 1.5862 1.4735 1.4239 1.4808 1.6937 1.4020 2.2279 2.4348 3.6228 1.6084 1.2395 2.3656 1.9122 1.1276 1.4821 1.0871 1.1609 3.5486 1.2220 1.0855 1.2134 1.1356 3.0084 1.3564 1.6490 6.2798 6.5666 6.2046 6.4503 6.3202 6.8776 1.0716 1.0710 1.0698 1.0628 1.0369 1.0627 1.0627 1.0873 1.0837 1.0854 1.0876 1.0990 1.1016 1.1019 1.0966 1.1002 1.0867 1.0849 1.0882 1.0888 1.0934 1.0951 1.1001 1.1007 1.0983 1.0775 1.0809
irintensity: 0.2279 0.5857 0.8707 0.2905 2.4181 1.7917 2.2133 1.1489 0.9597 1.1584 1.2955 0.9972 1.0355 2.9734 2.8369 8.9659 0.7849 15.1807 3.0952 0.2911 1.1986 4.7341 2.1495 0.4536 1.3191 4.1839 15.3221 1.2617 3.4476 6.7910 3.4939 79.8409 26.4777 6.6590 18.4412 57.2365 3.3045 8.4653 8.2687 0.6726 9.0022 7.6742 8.9112 2.8294 44.0912 6.4857 110.7658 11.4002 7.8944 3.3845 1.7788 24.9882 2.7031 13.9220 1.4317 0.1509 0.9977 0.5382 16.0584 1.4359 2.2889 6.3923 3.0008 0.0825 24.7368 0.2505 0.2835 1.0667 2.2135 22.2467 7.2173 6.1211 6.4331 5.8193 6.2374 30.4990 6.0975 35.5292 27.3778 5.5618 3.7095 40.8281 22.5344 2.7345 2.8545 1.1638 11.2724 1.9437 8.2417 17.9841 19.2752 16.1575 20.3902 0.9406 19.0446 7.3496 13.2507 4.3917 25.7405 19.1294 31.7069 0.7581 22.6385 13.9408 2.1316 2.4411 28.8163 6.6744 26.5643 2.5748 5.5836 52.5764 226.3181 9.8788 31.4032 44.5884 11.6992 5.1953 30.4085 38.6128 2.5695 30.6019 82.4468 2.6673 68.9711 0.1552 60.6388 39.3151 2.3846 122.0755 109.4286 98.2421 30.3780 25.0122 24.6735 16.5678 3.9839 32.0691 60.5627 40.9589 35.3566 29.6735 36.6178 19.1360 18.4885 10.9519 4.1762 3.9739 3.9244 33.8122 43.0197 26.0014 29.6755 1.3303 22.6964 62.8783
temp: 298.150 k
press: 1.00000 atm
elementType: 8 7 7 7 6 6 6 6 6 6 6 6 6 6 6 6 6 6 6 6 6 6 6 6 6 6 6 1 1 1 1 1 1 1 1 1 1 1 1 1 1 1 1 1 1 1 1 1 1 1 1 1 1 1
symmnumber: 1
zpe: 1188231.4 jmol-1
zpe.correction: 0.452573 hartree
zpe.thermalcorrener: 0.477174 hartree
zpe.thermalcorrenthalpy: 0.478119 hartree
zpe.thermalcorrgfe: 0.393332 hartree
zpe.sumelectzpe: -1130.182029 hartree
zpe.sumelectthermal: -1130.157428 hartree
zpe.sumelectthermalent: -1130.156484 hartree
zpe.sumelectthermalfe: -1130.241270 hartree
dipole: 3.4841 0.1229 -3.7635
dipole: 5.1301
quadrupole: -140.6533 -151.6387 -166.3021
quadrupole: -13.8579 1.0914 4.8809
quadrupole: 12.2114 1.2260 -13.4374 -13.8579 1.0914 4.8809
hfenergy: -1130.6346021 hartree
pointgroup: C01 [X(C23H27N3O1)]
dipole: -1.477374 0.232074 1.3554526 debye
polarizability: 335.0337592|-0.7172637|303.5742181|-8.9826132|-16.336042|170.1902937 unknown
InChI: InChI=1S/C23H27N3O/c1-17-6-2-3-7-20(17)23(27)25-19-11-14-26(15-12-19)13-10-18-16-24-22-9-5-4-8-21(18)22/h2-9,16,19,24-25H,10-15H2,1H3
charge 0 multiplicity 1
54 atoms
O  4.531139 -1.488705 -0.923529
N  -0.813091 -1.923307 0.410692
N  2.780591 -1.0632 0.54217
N  -6.645511 -0.414853 0.209349
C  2.118602 -2.364591 0.296519
C  1.228872 -2.319094 -0.973662
C  1.259625 -2.765931 1.516004
C  -0.023398 -1.448981 -0.756225
C  -0.002273 -1.885181 1.65122
C  -2.104428 -1.206639 0.562785
C  -3.167054 -1.655522 -0.476814
C  -4.473952 -0.916705 -0.323011
C  3.94799 -0.698803 -0.111381
C  -4.743012 0.4637 -0.699106
C  -5.6572 -1.413285 0.223777
C  -6.112515 0.75015 -0.354067
C  4.455456 0.688147 0.207824
C  -3.962607 1.483842 -1.307275
C  -6.707537 2.008927 -0.593256
C  5.853694 0.93937 0.367538
C  -4.550183 2.740127 -1.551464
C  3.52775 1.760786 0.29305
C  -5.907645 3.000927 -1.196175
C  6.263638 2.270255 0.63444
C  6.891883 -0.16355 0.270369
C  3.958796 3.079656 0.548944
C  5.336868 3.333108 0.725707
H  2.927874 -3.100052 0.13395
H  0.912335 -3.351118 -1.216648
H  1.822887 -1.936166 -1.822566
H  1.859551 -2.715773 2.444953
H  0.935652 -3.813605 1.377899
H  0.285626 -0.377131 -0.618395
H  -0.657512 -1.487795 -1.659047
H  -0.622572 -2.25686 2.487596
H  0.289618 -0.829945 1.918517
H  -1.970432 -0.096625 0.503535
H  -2.500171 -1.423552 1.572797
H  -2.772272 -1.498771 -1.499734
H  -3.315669 -2.744458 -0.360155
H  2.386633 -0.433066 1.243049
H  -5.869191 -2.406654 0.61608
H  -7.600826 -0.526689 0.540296
H  -2.919928 1.295713 -1.588824
H  -7.750418 2.213532 -0.325412
H  -3.960754 3.534601 -2.022814
H  2.462222 1.567136 0.118202
H  -6.33569 3.989252 -1.398099
H  7.332596 2.473144 0.770513
H  6.919263 -0.585927 -0.748546
H  7.893267 0.219136 0.532824
H  6.654056 -1.009602 0.940705
H  3.231549 3.897185 0.600049
H  5.689808 4.350848 0.926753
