program: Gaussian 09
title: 000205589
version: EM64L-G09RevD.01
frameworkgroup: C1[X(C22H27N)]
method: RPBEPBE
basis: SDD
operation: Freq
keyword: #pfreq=noraman
keyword: PBEPBE/SDD
title: #p freq=noraman PBEPBE/SDD
converged: YES YES NO NO
title: Mulliken charges:
elementType: N C C C C C C C C C C C C C C C C C C C C C C H H H H H H H H H H H H H H H H H H H H H H H H H H H
charge: -0.102743 -0.299478 0.393002 0.323050 0.119615 -0.514641 -0.581075 -0.591294 -0.372208 -0.437388 -0.409247 0.505615 -0.319142 -0.322508 -0.247720 -0.246304 -0.400903 -0.411753 -0.676547 -0.672640 -0.231210 -0.234927 -0.241574 0.250047 0.267265 0.240269 0.204021 0.213274 0.237837 0.216407 0.214660 0.238550 0.237399 0.186833 0.201624 0.187220 0.202970 0.223290 0.222388 0.229330 0.238389 0.228495 0.207813 0.205614 0.227238 0.210393 0.205173 0.223372 0.224680 0.227470
chargesum: 0.00000
title: Mulliken charges with hydrogens summed into heavy atoms:
elementType: N C C C C C C C C C C C C C C C C C C C C C C
charge: -0.102743 -0.049431 0.393002 0.323050 0.119615 -0.247376 -0.136785 -0.140183 0.058859 -0.198838 -0.171848 0.505615 0.069314 0.067682 -0.024430 -0.023916 -0.171573 -0.173364 -0.034625 -0.029836 -0.007837 -0.010248 -0.014104
polarizability: 2.82947639e+02 3.20280992e+01 2.79440939e+02 2.88387738e+01 -8.62080300e+00 1.72510151e+02
1716.lowfreq: -11.4006 -3.7606 -0.0006 0.0003 0.0006 6.8250 14.1299 15.6468 20.7079
frequency: 12.1407 15.2931 20.1419 31.0029 51.1353 54.2511 80.9882 86.7162 99.6062 101.6968 127.7856 158.4031 171.5393 202.3989 210.5199 239.7222 251.4722 258.8780 289.9374 303.0215 341.1679 376.6482 402.4031 413.0057 426.3620 439.8862 466.3857 472.1626 498.5161 531.2685 552.8864 570.2243 590.9497 616.8177 621.2233 689.1127 704.2319 729.1474 742.8803 748.7897 758.6288 771.7709 784.0665 796.9999 798.7014 803.4856 830.6092 838.1302 853.1477 873.8048 909.8301 911.9589 920.9111 940.6181 975.1258 980.0401 983.6958 988.3178 990.0925 993.5228 1011.9025 1018.3860 1025.9704 1028.6507 1051.1469 1069.8333 1072.1397 1074.0248 1078.2133 1084.9469 1102.9501 1114.4913 1141.2728 1150.3162 1164.5075 1171.4770 1178.3764 1185.8684 1187.3711 1203.8213 1216.3076 1224.2564 1244.2547 1266.7675 1277.4762 1280.0784 1284.2539 1292.2543 1305.2364 1308.0498 1327.8770 1342.6392 1358.8107 1359.5118 1374.6654 1381.3894 1387.4730 1388.5249 1401.2005 1439.0925 1447.4242 1457.7276 1461.2452 1463.0008 1466.3337 1469.8014 1470.4654 1478.4361 1483.0092 1484.8240 1486.7471 1491.4171 1583.5347 1592.0222 1613.1363 1614.3713 1615.8476 2846.3639 2856.2557 2879.0381 2954.0131 2978.9452 2982.3529 2983.0864 2990.2395 3016.7813 3031.3150 3039.7563 3054.6288 3062.0128 3073.1513 3075.4508 3091.1561 3092.1667 3110.6364 3115.9645 3117.6619 3122.5385 3131.1754 3137.4945 3142.9837 3157.9559 3161.4863 3173.2860
redmass: 3.7599 3.3683 4.2197 4.1743 3.5202 4.3955 2.3462 2.2654 2.8498 3.4342 4.4316 2.1098 2.0791 1.6045 1.9483 2.7457 2.4002 2.6306 2.2550 2.4787 2.3385 3.0347 2.8202 2.9525 3.2856 2.8512 3.2801 3.0038 3.4979 5.3944 3.6836 3.3127 4.2739 6.1826 4.1425 3.3937 1.7923 3.3398 2.2329 2.5996 1.6264 1.7808 1.4318 1.1712 1.8000 2.0971 1.4791 2.2958 1.2513 1.4099 2.2808 1.9817 1.5003 1.4702 1.3937 1.3303 2.3736 2.5491 6.1600 1.3108 2.1562 2.2033 2.1968 3.4071 1.8035 2.3981 2.4162 2.0379 1.8756 2.0931 1.7477 1.9705 1.1958 1.5407 1.2560 1.0531 1.5521 1.1315 1.4633 2.2834 2.5834 1.7340 1.5053 1.4126 1.2327 1.2992 1.4263 1.2273 1.3759 1.4945 1.2668 2.9779 1.3194 1.3418 1.3738 7.8124 1.2319 1.2300 4.6988 2.1628 2.4819 1.5423 1.5565 1.0773 1.1185 1.0598 1.1195 1.0547 2.2729 1.0775 1.0662 1.0755 6.4653 6.0447 6.1895 7.2163 7.7840 1.0720 1.0716 1.0707 1.0810 1.0643 1.0360 1.0358 1.0607 1.0870 1.0872 1.0874 1.1021 1.0980 1.0987 1.0980 1.1002 1.1002 1.0874 1.0858 1.0864 1.0889 1.0908 1.0939 1.0958 1.1000 1.1015 1.0957
irintensity: 0.0122 0.1548 0.0563 0.0072 0.1892 0.0874 0.3788 0.1929 0.1137 0.0876 0.4162 0.7869 0.8828 0.7744 0.1210 1.6654 1.5381 0.5894 2.3541 1.3884 0.5499 3.1120 0.0069 1.1452 7.5450 2.5781 2.3290 12.7889 1.6016 0.5767 21.1080 8.1426 5.0729 0.0738 1.7633 3.8195 50.0821 2.6996 12.8147 8.0762 90.2333 25.4094 3.5532 5.0144 7.3572 5.4874 9.1859 10.3740 0.0893 3.4836 2.7599 0.2317 5.5175 1.8744 0.2544 0.0639 4.0379 6.5201 0.0324 0.2071 7.5383 9.6595 7.6388 3.6631 5.1098 60.4172 2.1237 12.4828 15.9947 3.9083 16.1770 8.9168 1.0635 12.4149 0.5600 0.0594 1.2061 0.9956 4.8638 34.6250 0.2624 15.0958 2.2692 2.2511 0.4474 0.9003 0.5359 21.6086 13.1774 2.7747 0.1048 15.0027 13.0489 5.0470 1.0426 0.1016 21.1124 21.0413 5.1003 6.7058 4.0325 15.8396 12.0285 6.5393 0.5619 1.6844 7.4542 3.0068 21.3701 11.9753 9.5263 12.6549 1.8258 1.4343 11.8136 3.0357 6.5328 37.2894 117.2368 128.8152 9.6646 27.1025 38.5585 27.3811 25.6682 25.8424 20.7222 11.9586 15.2842 28.3999 39.1702 83.5798 39.2099 41.8596 10.6904 8.4040 7.4320 4.8140 12.7570 38.5874 43.3451 38.8464 25.3102 4.6919
temp: 298.150 k
press: 1.00000 atm
elementType: 7 6 6 6 6 6 6 6 6 6 6 6 6 6 6 6 6 6 6 6 6 6 6 1 1 1 1 1 1 1 1 1 1 1 1 1 1 1 1 1 1 1 1 1 1 1 1 1 1 1
symmnumber: 1
zpe: 1124712.2 jmol-1
zpe.correction: 0.428380 hartree
zpe.thermalcorrener: 0.450924 hartree
zpe.thermalcorrenthalpy: 0.451868 hartree
zpe.thermalcorrgfe: 0.372334 hartree
zpe.sumelectzpe: -907.581067 hartree
zpe.sumelectthermal: -907.558523 hartree
zpe.sumelectthermalent: -907.557579 hartree
zpe.sumelectthermalfe: -907.637113 hartree
dipole: 0.3567 0.0485 -0.6057
dipole: 0.7046
quadrupole: -128.9788 -132.9202 -138.7472
quadrupole: 2.9541 4.1108 -0.8488
quadrupole: 4.5699 0.6285 -5.1984 2.9541 4.1108 -0.8488
hfenergy: -908.0094475 hartree
pointgroup: C01 [X(C22H27N1)]
dipole: 0.1398746 -0.032741 0.2370768 debye
polarizability: 284.7042859|-29.7719438|278.6993945|-30.4159826|-1.8035592|171.4950488 unknown
InChI: InChI=1S/C22H27N/c1-3-23(4-2)15-14-19-17-20(16-18-10-6-5-7-11-18)22-13-9-8-12-21(19)22/h5-13,17,20H,3-4,14-16H2,1-2H3
charge 0 multiplicity 1
50 atoms
N  4.206478 1.37807 0.18125
C  -1.537153 -0.813803 0.361493
C  0.694403 -0.176691 -0.255194
C  -0.671016 -2.057942 0.183995
C  0.649869 -1.658916 -0.184276
C  -0.553426 0.309053 0.053929
C  1.928843 0.622799 -0.598868
C  -2.815594 -0.81485 -0.546807
C  2.962835 0.659838 0.562366
C  -0.999448 -3.416763 0.316965
C  1.649921 -2.629227 -0.421446
C  -3.699261 0.404244 -0.326633
C  5.141641 0.513588 -0.589756
C  4.864021 2.047859 1.336592
C  0.005156 -4.391554 0.080171
C  1.315959 -3.998804 -0.286709
C  -4.585103 0.459544 0.781325
C  -3.643337 1.519578 -1.201311
C  6.10439 1.312826 -1.488697
C  4.14716 3.342484 1.766024
C  -5.390554 1.596735 1.012118
C  -4.448206 2.659955 -0.976075
C  -5.324527 2.702966 0.132834
H  -1.883112 -0.735488 1.415342
H  -0.835919 1.364684 0.080996
H  1.662954 1.6650 -0.848579
H  2.413489 0.19352 -1.498868
H  -3.385578 -1.738799 -0.328706
H  -2.486406 -0.874838 -1.600394
H  2.497002 1.18308 1.416192
H  3.178045 -0.380354 0.911333
H  -2.011544 -3.730276 0.600176
H  2.666558 -2.334666 -0.707267
H  5.725925 -0.160239 0.088787
H  4.53387 -0.148703 -1.234735
H  4.955465 1.355997 2.212786
H  5.8955 2.304886 1.034104
H  -0.233384 -5.456483 0.180019
H  2.077649 -4.766022 -0.467599
H  -4.648034 -0.398469 1.463353
H  -2.966042 1.49018 -2.063843
H  5.530882 1.942886 -2.19052
H  6.766555 1.975155 -0.902017
H  6.749076 0.627356 -2.070291
H  4.108696 4.051393 0.920793
H  3.109969 3.150759 2.095856
H  4.682387 3.820745 2.607896
H  -6.071526 1.619634 1.870694
H  -4.394567 3.510532 -1.665286
H  -5.950959 3.584938 0.307486
