program: Gaussian 09
title: 000205587
version: EM64L-G09RevD.01
frameworkgroup: C1[X(C10H14ClO3PS)]
method: RPBEPBE
basis: SDD
operation: Freq
keyword: #p
keyword: freq=noraman
keyword: PBEPBE/SDD
title: #p freq=noraman PBEPBE/SDD
converged: YES YES NO NO
title: Mulliken charges:
elementType: Cl S P O O O C C C C C C C C C C H H H H H H H H H H H H H H
charge: -0.063162 -0.226790 0.876206 -0.506877 -0.464723 -0.484594 0.389352 -0.215361 -0.209420 -0.303148 -0.374305 -0.651678 -0.654922 -0.044497 -0.168741 -0.248376 0.230064 0.230345 0.228635 0.234325 0.307643 0.257142 0.212080 0.231068 0.238090 0.214512 0.234212 0.237441 0.236728 0.258753
chargesum: 0.00000
title: Mulliken charges with hydrogens summed into heavy atoms:
elementType: Cl S P O O O C C C C C C C C C C
charge: -0.063162 -0.226790 0.876206 -0.506877 -0.464723 -0.484594 0.389352 0.245048 0.253539 0.004495 -0.117164 0.029561 0.031243 -0.044497 0.067987 0.010378
polarizability: 2.14309775e+02 8.26010100e+00 1.78852007e+02 2.32677530e+00 -9.93629311e+00 1.25891849e+02
1716.lowfreq: -28.0223 -13.9343 -5.4179 -2.5431 0.0010 0.0010 0.0014 13.0236 20.8452
frequency: -15.5941 -10.8130 18.3400 24.0919 30.6197 44.5232 68.7170 96.6431 121.3454 157.3492 185.5177 198.6854 212.0650 234.6302 241.2123 256.1105 263.2390 280.8332 319.3932 356.1338 383.7535 417.7614 433.8180 444.4956 480.7031 534.5712 577.2227 642.9951 674.9965 694.6722 703.0878 708.4831 783.8220 807.4952 808.8806 859.3867 869.7683 882.6569 886.5363 900.6490 972.7016 983.3077 1012.0897 1020.7291 1064.5303 1082.4673 1103.9365 1105.8757 1131.6162 1134.5747 1162.6299 1181.3234 1250.0458 1251.4252 1276.8457 1349.2763 1352.8904 1375.6441 1394.1945 1395.4844 1416.0897 1454.1309 1457.2214 1458.6191 1476.0500 1477.0718 1485.7571 1486.7951 1578.2365 1596.7027 2989.9065 2992.6642 2996.8761 2997.1426 3057.6375 3059.7793 3093.1887 3093.3823 3111.0840 3111.9771 3148.6478 3174.9105 3182.8686 3185.4322
redmass: 3.5681 2.3541 2.2945 4.3702 4.2372 3.7251 5.2460 5.8072 5.3353 7.2580 5.3113 3.7753 2.6165 1.3522 2.3471 3.7428 3.2607 3.5051 5.3428 6.6571 12.1669 5.9205 4.9435 3.7697 7.2266 8.5613 6.0243 8.3102 2.3958 6.0164 7.9419 9.1462 1.3715 1.0940 1.0978 7.4001 4.5447 3.7482 1.4736 1.4279 1.3359 6.1485 2.3880 2.6579 1.8914 1.5260 2.2335 2.2188 1.4189 1.4264 1.3634 2.3176 1.1511 1.1455 1.3014 1.2569 1.2563 8.7555 1.2417 1.2401 2.9517 2.3249 1.0401 1.0452 1.0591 1.0569 1.0752 1.0754 6.8833 7.2510 1.0543 1.0514 1.0390 1.0406 1.1079 1.1084 1.0982 1.0981 1.1025 1.1024 1.0879 1.0931 1.0944 1.0980
irintensity: 2.2187 0.4190 0.4619 1.4636 0.3687 3.1052 1.4339 1.4899 1.9597 0.9747 1.3541 2.9977 5.8564 0.0127 0.4116 6.1231 16.5824 2.5691 5.4394 10.2158 4.0840 7.6508 3.6115 16.1010 9.8346 31.9055 2.4849 69.0735 23.3094 81.1593 108.7775 93.9914 63.6504 3.1701 2.7140 302.6524 273.8612 48.7172 46.3962 8.2650 0.8450 3.1874 147.9965 81.8741 20.1163 12.3866 11.7978 8.6406 4.3328 4.9331 30.5967 78.6728 0.2996 0.4384 12.5219 8.7475 8.0332 1.7589 26.7935 26.5817 23.4213 121.9284 13.1768 10.0061 3.5849 10.1138 10.3187 12.6019 84.0235 73.5971 21.7909 21.6166 30.6237 16.5235 11.4084 10.7129 25.9149 26.7741 31.6967 31.4956 8.6156 2.9322 0.4204 7.9207
temp: 298.150 k
press: 1.00000 atm
elementType: 17 16 15 8 8 8 6 6 6 6 6 6 6 6 6 6 1 1 1 1 1 1 1 1 1 1 1 1 1 1
symmnumber: 1
zpe: 587898.6 jmol-1
zpe.correction: 0.223919 hartree
zpe.thermalcorrener: 0.241336 hartree
zpe.thermalcorrenthalpy: 0.242280 hartree
zpe.thermalcorrgfe: 0.175281 hartree
zpe.sumelectzpe: -1813.249397 hartree
zpe.sumelectthermal: -1813.231980 hartree
zpe.sumelectthermalent: -1813.231035 hartree
zpe.sumelectthermalfe: -1813.298034 hartree
dipole: -2.1836 -0.5810 -0.2734
dipole: 2.2761
quadrupole: -106.7220 -99.0328 -126.7242
quadrupole: -5.3171 4.5502 1.3729
quadrupole: 4.1043 11.7936 -15.8979 -5.3171 4.5502 1.3729
hfenergy: -1813.4733155 hartree
pointgroup: C01 [X(C10H14Cl1O3P1S1)]
dipole: 0.7856942 -0.4295402 -0.0073693 debye
polarizability: 208.6707395|-14.4285674|181.2739593|-3.7175035|17.2246156|129.1089318 unknown
InChI: InChI=1S/C10H14ClO3PS/c1-3-12-15(16,13-4-2)14-10-7-5-6-9(11)8-10/h5-8H,3-4H2,1-2H3
charge 0 multiplicity 1
30 atoms
Cl -3.872952 2.251396 0.935189
S  1.366365 -0.251539 -2.410282
P  1.435872 -0.162947 -0.351916
O  0.203809 -1.018111 0.552336
O  2.82389 -0.801317 0.434391
O  1.326179 1.380856 0.404321
C  -1.183671 -0.780335 0.361122
C  3.373151 -2.117409 -0.022247
C  2.10494 2.520764 -0.178838
C  -1.738732 0.482859 0.671809
C  -1.985918 -1.861967 -0.059471
C  4.745251 -2.251843 0.629574
C  1.611513 3.776848 0.531256
C  -3.130482 0.630297 0.543104
C  -3.381762 -1.673985 -0.165036
C  -3.971449 -0.422988 0.132029
H  2.679675 -2.912175 0.308907
H  3.432254 -2.116681 -1.127835
H  3.178306 2.333508 0.008144
H  1.920839 2.557134 -1.269518
H  -1.092973 1.300501 1.002124
H  -1.516668 -2.821531 -0.292784
H  5.195512 -3.222104 0.349549
H  5.418522 -1.44375 0.297499
H  4.660382 -2.210498 1.728416
H  2.169335 4.655882 0.158886
H  0.537153 3.939512 0.340655
H  1.769973 3.699108 1.619968
H  -4.018589 -2.50391 -0.487851
H  -5.050824 -0.272175 0.0454
