program: Gaussian 09
title: 000205559
version: EM64L-G09RevD.01
frameworkgroup: C1[X(C14H15NO3)]
method: RPBEPBE
basis: SDD
operation: Freq
keyword: #p
keyword: freq=noraman
keyword: PBEPBE/SDD
title: #p freq=noraman PBEPBE/SDD
converged: NO YES NO NO
title: Mulliken charges:
elementType: O O O N C C C C C C C C C C C C C C H H H H H H H H H H H H H H H
charge: -0.244609 -0.276842 -0.186610 -0.139309 -0.348593 -0.377110 -0.453445 -0.453497 -0.333141 0.229100 -0.570310 0.390802 0.175014 0.152272 -0.421241 -0.362153 -0.241041 -0.216504 0.253062 0.241117 0.267050 0.218514 0.220459 0.233706 0.236345 0.229364 0.281795 0.284447 0.240809 0.241390 0.262805 0.231299 0.235054
chargesum: 0.00000
title: Mulliken charges with hydrogens summed into heavy atoms:
elementType: O O O N C C C C C C C C C C C C C C
charge: -0.244609 -0.276842 -0.186610 -0.139309 0.145586 0.108453 0.000721 0.012213 -0.051346 0.229100 -0.045053 0.390802 0.175014 0.152272 -0.179851 -0.099348 -0.009742 0.018550
polarizability: 2.32065865e+02 -5.23875318e+00 1.49288566e+02 -1.52424125e+01 2.14724442e+00 1.08738695e+02
1716.lowfreq: -11.2997 -5.0147 -0.0004 -0.0002 0.0004 7.5797 33.6405 46.1112 67.1029
frequency: 33.4780 45.9911 67.0448 82.7877 96.8464 136.4747 161.3409 197.8421 214.9641 246.3781 263.5572 272.1740 283.0820 318.0472 396.2756 407.2567 450.7771 497.9672 526.3738 540.6226 562.3772 570.0276 582.9885 647.5656 666.6862 699.2863 721.4668 751.6960 765.2215 797.5565 837.6816 861.2249 867.0285 869.7480 880.9069 915.1277 921.1612 941.3619 959.9065 965.7558 984.3656 994.4670 1025.7188 1058.8226 1067.5174 1088.3317 1098.2873 1114.5875 1151.3724 1162.6108 1167.8801 1170.9188 1172.8003 1180.1884 1209.3321 1225.5329 1230.7413 1248.4380 1264.7733 1285.6988 1306.7578 1316.3270 1331.3767 1335.6290 1338.1974 1388.9321 1392.5353 1442.1268 1457.3586 1470.5008 1473.9607 1479.7331 1481.5290 1492.4173 1590.3353 1595.8363 1619.9487 1667.6688 2960.4479 2968.7796 2997.2548 3002.0744 3009.9817 3016.5727 3068.2304 3068.5647 3071.9029 3082.9351 3096.0340 3127.3598 3143.2605 3160.4713 3175.9901
redmass: 4.7594 4.3266 3.4716 3.5259 5.9367 4.5437 4.8818 3.4118 5.7665 1.6979 3.3280 4.1307 4.4073 5.8002 5.5302 5.1702 3.8540 6.4551 3.7854 5.1712 7.4101 1.9599 5.5774 4.7372 6.0681 3.8584 3.2956 3.4256 1.3553 3.4052 2.3569 2.0030 1.8785 1.7540 4.9000 2.2795 1.6127 1.5227 2.3523 2.1012 1.3246 2.2393 2.2461 2.4045 2.2222 3.4311 2.1473 1.6246 2.4963 1.3452 1.2380 1.2776 2.2887 1.8155 1.3623 1.2892 2.4701 1.2520 1.4974 1.2762 1.3461 1.2282 1.6604 1.4903 1.5385 7.2185 7.6104 2.2915 1.1711 1.0882 1.0991 2.1860 1.1350 1.0935 7.4123 8.0611 7.6300 11.8957 1.0680 1.0809 1.0649 1.0636 1.0648 1.0625 1.0985 1.0989 1.0949 1.1011 1.1056 1.0877 1.0896 1.0947 1.0994
irintensity: 1.3328 2.6082 0.9611 0.7812 3.0890 1.2399 1.7544 5.6405 0.3392 0.5684 4.8634 5.5292 6.9025 6.9606 0.6656 2.9967 6.0106 18.2727 3.6448 6.8024 3.1269 1.7992 10.6075 6.1640 8.2421 12.0729 5.6290 5.8242 81.2033 18.0997 19.6149 3.2916 5.5240 4.5012 11.6638 9.1958 1.9706 8.4507 14.2607 43.4357 0.4160 11.7499 10.5060 92.7056 196.4443 186.7952 21.3458 3.5448 21.3597 2.6501 2.0573 13.7832 65.2889 3.9795 18.1990 15.2150 45.5521 6.8561 6.0877 10.7080 1.6341 0.5617 5.7770 5.3436 7.9161 83.5395 99.9928 39.6607 23.2930 12.2860 8.6793 46.1309 4.9020 3.8733 87.8060 245.9856 29.3095 310.3432 45.8700 4.0051 22.7247 5.0400 31.8500 25.5341 3.1776 28.4833 10.1120 25.6992 51.4571 3.7871 10.2880 20.9260 12.2545
temp: 298.150 k
press: 1.00000 atm
elementType: 8 8 8 7 6 6 6 6 6 6 6 6 6 6 6 6 6 6 1 1 1 1 1 1 1 1 1 1 1 1 1 1 1
symmnumber: 1
zpe: 694177.8 jmol-1
zpe.correction: 0.264398 hartree
zpe.thermalcorrener: 0.279777 hartree
zpe.thermalcorrenthalpy: 0.280721 hartree
zpe.thermalcorrgfe: 0.220867 hartree
zpe.sumelectzpe: -821.618718 hartree
zpe.sumelectthermal: -821.603339 hartree
zpe.sumelectthermalent: -821.602395 hartree
zpe.sumelectthermalfe: -821.662249 hartree
dipole: 0.4016 0.5464 4.8996
dipole: 4.9463
quadrupole: -80.6007 -110.1153 -110.6232
quadrupole: -3.8761 3.4779 0.6602
quadrupole: 19.8457 -9.6689 -10.1768 -3.8761 3.4779 0.6602
hfenergy: -821.8831163 hartree
pointgroup: C01 [X(C14H15N1O3)]
dipole: -0.1320278 0.4270787 -1.8939849 debye
polarizability: 232.3721239|7.5400337|149.3784127|-12.6592405|2.394829|108.3425901 unknown
InChI: InChI=1S/C14H15NO3/c16-13(15-7-3-4-8-15)11-9-10-5-1-2-6-12(10)18-14(11)17/h1-2,5-6,11H,3-4,7-9H2
charge 0 multiplicity 1
33 atoms
O  1.435915 -1.516927 0.548923
O  -1.673822 1.59673 1.470246
O  -0.760732 -1.945393 0.966184
N  -2.726584 0.342145 -0.166552
C  -4.078394 0.785744 0.2773
C  -2.797653 -0.670539 -1.257652
C  -5.017531 0.230414 -0.816571
C  -4.296183 -1.058647 -1.287736
C  -0.235559 0.273035 -0.01481
C  -1.608088 0.778747 0.496376
C  0.872125 1.293254 0.349154
C  2.238288 0.755136 -0.013052
C  0.075577 -1.126839 0.548486
C  2.465661 -0.63595 0.092075
C  3.320518 1.565081 -0.428151
C  3.709777 -1.228887 -0.188834
C  4.582497 0.998097 -0.717545
C  4.776729 -0.399041 -0.596868
H  -4.102067 1.883912 0.377593
H  -4.299365 0.356622 1.273448
H  -2.153019 -1.535911 -1.033566
H  -2.485567 -0.222963 -2.223902
H  -5.09781 0.95002 -1.652435
H  -6.032949 0.037993 -0.432448
H  -4.479289 -1.878472 -0.569652
H  -4.617482 -1.397621 -2.286778
H  -0.268014 0.152999 -1.118508
H  0.794205 1.509978 1.432087
H  0.670159 2.248307 -0.165523
H  3.170743 2.647482 -0.518832
H  3.826041 -2.311358 -0.081584
H  5.409954 1.641048 -1.035299
H  5.753415 -0.841696 -0.818477
