program: Gaussian 09
title: 000205533
version: EM64L-G09RevD.01
frameworkgroup: C1[X(C18H36N2O2)]
method: RPBEPBE
basis: SDD
operation: Freq
keyword: #p
keyword: freq=noraman
keyword: PBEPBE/SDD
title: #p freq=noraman PBEPBE/SDD
converged: NO YES NO NO
title: Mulliken charges:
elementType: O O N N C C C C C C C C C C C C C C C C C C H H H H H H H H H H H H H H H H H H H H H H H H H H H H H H H H H H H H
charge: -0.461104 -0.329117 0.144762 -0.636534 -0.486717 0.006309 -0.462554 -0.416756 -0.391365 -0.394647 -0.382248 -0.656782 -0.517104 -0.375740 -0.372648 -0.350705 0.170732 -0.356143 0.370079 -0.697110 -0.785935 -0.675974 0.243508 0.298620 0.213818 0.238425 0.226959 0.173900 0.212445 0.195399 0.197884 0.189582 0.240411 0.189415 0.187015 0.392163 0.199813 0.238596 0.242821 0.336026 0.216789 0.200282 0.189022 0.305966 0.188929 0.185365 0.185098 0.187894 0.194263 0.194864 0.208575 0.214639 0.209599 0.231902 0.216784 0.257190 0.229983 0.223357
chargesum: 0.00000
title: Mulliken charges with hydrogens summed into heavy atoms:
elementType: O O N N C C C C C C C C C C C C C C C C C C
charge: -0.125078 -0.329117 0.144762 0.061595 0.055411 0.220127 0.002830 -0.030411 0.001918 0.035346 -0.005818 -0.218374 -0.057494 0.013564 0.001646 0.022287 0.170732 0.032984 0.370079 -0.064297 -0.080060 -0.222634
polarizability: 2.80770962e+02 -2.05239226e+01 2.41994368e+02 7.50395175e+00 -6.76437417e-01 1.72759317e+02
1716.lowfreq: -15.8171 -4.9629 -0.0005 0.0002 0.0008 2.9359 7.3934 10.3387 17.0419
frequency: -11.3428 9.7707 15.5699 24.2572 28.3322 37.2038 43.7842 49.4831 55.0127 78.0968 82.4148 86.7382 94.5841 98.7083 105.7242 132.8903 135.9044 139.9463 143.0197 154.2099 166.4597 180.4189 213.1932 216.6834 225.2329 250.5091 273.9164 283.7437 300.4098 331.6635 356.3613 368.1225 406.2634 431.3772 441.4885 452.6775 459.3432 478.0240 503.3179 517.0727 523.5111 551.9723 568.1506 643.1328 648.1689 675.3593 690.8541 709.9435 718.7636 726.8780 732.8680 748.7001 751.5034 779.9837 780.9590 805.8352 844.9360 876.1833 883.0486 889.5488 921.4376 933.4531 939.1320 943.6890 959.9169 974.9738 997.6933 1002.7130 1010.0341 1015.7717 1027.3681 1051.5832 1052.1426 1060.5156 1074.5937 1077.2711 1080.3140 1083.9729 1090.9708 1103.2918 1107.1450 1120.1614 1131.0332 1167.2854 1184.3689 1208.0924 1220.4461 1228.4912 1229.3899 1247.0440 1255.6452 1262.2049 1276.3697 1279.9654 1285.7015 1292.1531 1294.6961 1309.0898 1319.4209 1323.0835 1333.0229 1338.0869 1350.4795 1350.7798 1353.5087 1363.9829 1370.4221 1382.7397 1386.8517 1392.9134 1398.6965 1429.5404 1439.4481 1448.4042 1453.2677 1459.2516 1459.9044 1460.5445 1464.8972 1467.2047 1471.2008 1473.9138 1475.4538 1476.1649 1480.2129 1484.3326 1486.4312 1489.5760 1542.0210 1557.4387 1638.5296 1658.8294 2935.9684 2942.7488 2945.8672 2948.2593 2949.3620 2954.6067 2959.9339 2966.8470 2969.0264 2970.2440 2981.4597 2982.8343 2987.3001 2994.4346 2997.9569 3002.5836 3013.3068 3019.8162 3020.4317 3032.2553 3042.0007 3044.7357 3063.0797 3064.2147 3066.4046 3069.3745 3093.3893 3094.7559 3101.4963 3103.4239 3145.6162 3195.6430 3233.1281 3289.7826 3565.7809 3598.8502
redmass: 2.1087 4.2722 2.6050 4.3930 3.8188 3.7172 3.5393 4.0178 3.7530 4.4240 4.8643 1.8220 2.6202 4.5122 3.1754 3.2695 2.0285 3.9962 2.0729 1.0570 3.4684 2.8379 1.8428 1.4625 1.1334 3.1189 3.5768 2.6469 2.9918 3.4950 2.8339 2.5370 2.2036 1.7307 2.4559 2.3799 2.4834 1.8834 2.2146 2.5722 1.7838 3.6207 1.1285 1.5033 1.2751 1.5971 1.4764 1.3847 1.0619 1.1115 2.2991 1.3284 2.8169 1.7122 2.1711 1.6919 1.8383 1.6193 2.6581 2.0566 1.5760 1.1785 1.5538 1.8317 1.3190 1.7037 2.8412 1.3880 3.4220 1.3153 2.3928 2.1940 1.7795 1.5684 2.0578 1.8854 2.1455 2.1038 1.7099 1.6129 2.3139 2.2583 1.7451 1.2829 1.7583 1.3319 1.3440 2.5637 1.3222 1.2566 1.2693 1.2689 1.2020 1.0470 1.1960 1.0882 1.2166 1.2058 1.2982 1.3311 1.4632 2.1158 1.5704 1.3855 1.6734 1.5100 1.4839 1.5931 1.2196 2.0059 1.5237 1.2797 1.0977 1.0482 1.0908 1.1127 1.0796 1.0721 1.0738 1.0791 1.0770 1.0828 1.0732 1.0458 1.0829 1.2704 1.0864 1.0984 3.2489 4.0825 1.5677 2.9586 1.0653 1.0830 1.0587 1.0593 1.0590 1.0615 1.0600 1.0585 1.0606 1.0370 1.0955 1.0375 1.0970 1.0847 1.0869 1.0926 1.0949 1.0680 1.0955 1.1039 1.1037 1.0746 1.0990 1.0954 1.1007 1.0992 1.1050 1.0633 1.1006 1.0515 1.0543 1.1139 1.1187 1.1211 1.0660 1.0831
irintensity: 0.1489 0.1105 0.1514 0.5087 2.3878 0.4390 0.8946 0.9636 1.7975 4.2696 0.3563 0.3327 0.1628 7.3702 1.2097 0.7040 0.4492 13.4833 0.4856 0.4537 5.9116 3.7284 38.9274 57.6461 0.0059 4.2042 54.6005 0.5166 10.0690 10.9426 2.3247 8.5029 0.6229 3.1641 0.3871 4.3916 2.6490 6.1099 7.3222 2.6984 22.1354 8.1939 101.0260 26.6783 47.3698 11.5460 327.6874 21.3176 12.4179 0.1879 79.9310 2.7315 4.6370 2.4933 5.9378 2.5897 12.3299 15.5848 5.2514 3.2669 38.4503 51.1779 13.0791 4.9826 64.9907 1.2704 3.7780 7.0347 6.6342 1.4810 22.1875 3.9566 4.4424 2.2841 12.8894 22.9769 0.5386 3.9475 10.2684 3.8848 1.0551 27.1582 5.3179 22.4922 1.4572 12.3634 2.7706 39.5860 25.6110 2.2252 15.5789 1.8960 20.8457 3.9032 12.8323 3.1588 0.6014 3.1984 5.6445 9.7976 1.8009 9.6593 0.5948 4.6577 0.5687 1.3535 12.6368 122.6964 9.4906 33.0925 8.4150 20.9569 15.6443 12.8613 11.8553 6.4111 0.1273 0.3713 1.0820 13.2183 1.9803 3.9383 35.0856 9.2056 1.1444 12.9651 4.9781 27.3205 116.0101 208.4529 147.6774 43.7713 58.0830 30.1966 5.8161 0.7516 3.6628 6.2792 40.2442 71.1374 159.5193 31.5240 1.5243 23.1298 3.8417 4.5063 9.9485 14.6006 21.4984 11.7749 28.5538 13.1249 230.2986 1489.3704 51.5333 11.8328 103.8021 56.3251 70.3504 4.1590 11.9725 4.8666 11.9841 17.2027 10.4269 5.6902 1.3979 44.8400
temp: 298.150 k
press: 1.00000 atm
elementType: 8 8 7 7 6 6 6 6 6 6 6 6 6 6 6 6 6 6 6 6 6 6 1 1 1 1 1 1 1 1 1 1 1 1 1 1 1 1 1 1 1 1 1 1 1 1 1 1 1 1 1 1 1 1 1 1 1 1
symmnumber: 1
zpe: 1344302.5 jmol-1
zpe.correction: 0.512018 hartree
zpe.thermalcorrener: 0.540736 hartree
zpe.thermalcorrenthalpy: 0.541680 hartree
zpe.thermalcorrgfe: 0.447702 hartree
zpe.sumelectzpe: -965.580434 hartree
zpe.sumelectthermal: -965.551716 hartree
zpe.sumelectthermalent: -965.550772 hartree
zpe.sumelectthermalfe: -965.644750 hartree
dipole: -0.6946 1.0285 -0.7517
dipole: 1.4509
quadrupole: -144.6770 -120.6605 -141.7257
quadrupole: -0.3819 -4.2065 1.6608
quadrupole: -8.9893 15.0273 -6.0380 -0.3819 -4.2065 1.6608
hfenergy: -966.0924522 hartree
pointgroup: C01 [X(C18H36N2O2)]
dipole: 0.0418086 0.2439373 -0.5143982 debye
polarizability: 246.2923384|-13.9460794|237.9184883|22.6901207|-49.2852024|211.3138209 unknown
InChI: InChI=1S/C14H29NO.C4H7NO/c1-4-5-6-7-8-9-10-11-12-14(16)13-15(2)3;1-3(2)4(5)6/h14,16H,2-13H2,1H3;1,5H2,2H3
charge 0 multiplicity 1
58 atoms
O  1.657229 -2.532828 3.699837
O  0.959654 0.819365 -0.389972
N  3.549671 -1.584585 1.401528
N  3.144385 1.393645 -0.943716
C  2.366496 -0.905522 2.043046
C  1.22246 -1.839201 2.467001
C  0.75897 -2.824177 1.375383
C  -0.602492 -3.504246 1.673506
C  -1.807978 -2.531305 1.758133
C  -2.000117 -1.649286 0.501392
C  -3.278518 -0.783581 0.561915
C  3.599499 -1.514504 0.018378
C  4.456352 -2.141673 2.230787
C  -3.416967 0.165371 -0.650438
C  -4.678594 1.054789 -0.59572
C  -4.79484 2.027916 -1.791214
C  1.794135 1.654035 -0.890591
C  -6.062098 2.911316 -1.742096
C  1.314901 2.979451 -1.450592
C  -6.163474 3.88914 -2.933075
C  -0.093813 2.96913 -2.003524
C  2.084757 4.100378 -1.378356
H  2.731701 -0.371589 2.936719
H  1.966006 -0.178117 1.317178
H  0.382206 -1.157862 2.725513
H  1.54512 -3.59189 1.236376
H  0.67964 -2.27597 0.419738
H  -0.543716 -4.094895 2.615052
H  -0.795435 -4.245925 0.87237
H  -2.728135 -3.128223 1.925307
H  -1.708624 -1.87599 2.648024
H  -2.03842 -2.298975 -0.398803
H  -1.128908 -0.978504 0.363594
H  -3.266824 -0.181142 1.49484
H  -4.172586 -1.439226 0.625708
H  3.504316 0.480355 -0.576181
H  4.393311 -2.082691 -0.476791
H  2.642305 -1.38059 -0.490947
H  4.305834 -2.056583 3.304189
H  1.076096 -3.321614 3.842968
H  5.303423 -2.683709 1.807885
H  -2.512589 0.80661 -0.707366
H  -3.4298 -0.433271 -1.585518
H  3.775799 2.026547 -1.433043
H  -4.675349 1.637061 0.349801
H  -5.582114 0.410167 -0.55972
H  -3.895373 2.679351 -1.821572
H  -4.789481 1.448999 -2.738748
H  -6.959079 2.259014 -1.720124
H  -6.070767 3.482345 -0.791084
H  -5.294076 4.573318 -2.957846
H  -7.078549 4.507213 -2.875776
H  -6.185011 3.341249 -3.8943
H  -0.162259 2.326296 -2.901753
H  -0.432124 3.984486 -2.269104
H  -0.783426 2.534215 -1.258095
H  1.719273 5.063579 -1.751876
H  3.077796 4.104437 -0.913624
