program: Gaussian 09
title: 000205513
version: EM64L-G09RevD.01
frameworkgroup: C1[X(C17H18ClN)]
method: RPBEPBE
basis: SDD
operation: Freq
keyword: #p
keyword: freq=noraman
keyword: PBEPBE/SDD
title: #p freq=noraman PBEPBE/SDD
converged: YES YES NO NO
title: Mulliken charges:
elementType: Cl N C C C C C C C C C C C C C C C C C H H H H H H H H H H H H H H H H H H
charge: -0.090237 -0.086842 -0.615022 -0.617713 0.377788 0.376828 -0.758240 0.373315 0.374670 -0.305467 -0.422115 -0.422120 -0.395055 -0.394302 -0.582777 -0.243434 -0.243872 -0.246529 -0.246612 0.223346 0.216426 0.216535 0.224235 0.204250 0.227282 0.248452 0.248299 0.234097 0.234236 0.225835 0.225960 0.263325 0.263919 0.228637 0.228646 0.227165 0.227092
chargesum: 0.00000
title: Mulliken charges with hydrogens summed into heavy atoms:
elementType: Cl N C C C C C C C C C C C C C C C C C
charge: -0.090237 -0.086842 -0.175251 -0.176943 0.377788 0.376828 -0.326708 0.373315 0.374670 0.191284 -0.188018 -0.187884 -0.169219 -0.168343 -0.055534 -0.014797 -0.015226 -0.019364 -0.019521
polarizability: 2.14636416e+02 8.39152446e-02 2.10075494e+02 1.56595284e+01 -3.76802001e-01 1.51673831e+02
1716.lowfreq: -0.0016 0.0003 0.0007 3.7064 11.2484 12.6693 21.2603 36.9826 57.5516
frequency: 21.1245 36.8959 57.5482 70.5347 94.2340 130.7601 150.8460 170.8069 187.1486 229.0723 273.2804 283.5645 307.7986 377.9924 395.4681 413.7399 415.0402 438.8840 450.9442 475.4054 509.7165 515.3037 571.3172 601.1317 608.6759 619.1861 650.0388 717.1821 725.5064 746.2466 756.3962 763.0714 772.6700 788.4078 829.5836 844.5356 846.4234 879.5997 900.6461 924.2698 932.4387 951.2060 954.4808 962.2827 988.9240 990.3449 996.4130 1040.0285 1047.6486 1052.8384 1074.6463 1089.8091 1095.7442 1144.0867 1163.7057 1175.1655 1175.6743 1178.4939 1182.2250 1184.9332 1210.4174 1223.3648 1243.1376 1262.6764 1283.2543 1289.4136 1303.2283 1330.2644 1332.1291 1342.9265 1359.7979 1362.6842 1384.1505 1389.7801 1435.6983 1436.8954 1447.3077 1460.8585 1463.1627 1479.0627 1480.7032 1481.7649 1494.5741 1588.1857 1589.2289 1606.0473 1610.4973 2967.9115 2970.8973 2991.1132 2995.6639 3022.7994 3029.2453 3049.4044 3049.8304 3058.7298 3108.7290 3110.0847 3115.3204 3117.8872 3137.3978 3137.9379 3144.9912 3160.0524 3160.4108
redmass: 6.8830 6.7210 5.2263 3.1909 2.6560 4.2053 3.5683 4.7201 6.0950 3.5869 4.8341 4.0739 5.3466 4.0044 2.6441 2.4261 2.0487 2.7787 3.2407 3.2878 3.8852 2.8588 4.8831 4.4039 4.4327 4.5248 5.7933 2.9575 4.5100 2.9997 1.4643 1.4321 1.7350 1.9078 3.6963 2.2934 3.4062 1.4959 1.9864 1.8792 1.7677 1.7439 1.4749 1.7235 1.3322 1.3258 1.4927 2.3775 2.4018 4.0779 1.9491 1.6716 2.6305 1.8925 1.1607 1.0928 1.1083 2.5132 1.1959 2.4368 2.6192 2.3873 1.1505 1.3320 1.4960 1.3320 1.4300 1.6270 1.4303 1.2589 1.5213 1.4113 4.2893 3.2493 2.2469 2.2016 1.1019 1.1195 1.1837 1.7489 1.1532 2.0836 1.2082 6.6933 6.2970 6.2564 6.4038 1.0604 1.0623 1.0599 1.0593 1.1008 1.1002 1.1014 1.1041 1.0561 1.0878 1.0875 1.0886 1.0883 1.0921 1.0923 1.1126 1.1004 1.1004
irintensity: 0.4759 0.1265 0.2629 0.2081 1.2730 0.1077 0.1614 1.1746 1.5063 1.6141 28.2547 1.3939 0.1236 12.0106 0.0488 0.8383 1.8934 1.4537 2.0373 8.2618 0.9146 16.6261 6.0352 10.0200 0.0471 32.6349 99.4301 40.8053 0.0007 37.5763 40.5247 15.4976 2.5593 36.1987 1.1131 4.3391 0.4634 0.8932 1.3357 1.9609 6.5946 2.1226 0.0020 14.5334 0.4236 0.0193 8.7613 10.9759 4.4324 2.0438 32.7658 10.6457 35.6375 23.8478 0.0655 0.5430 0.6767 24.6870 0.1104 4.6483 7.7938 1.4638 15.2826 4.9344 7.5146 2.3468 3.9528 14.2441 15.4910 6.6444 0.3864 0.4919 1.4689 0.0116 5.7120 5.8087 4.4621 26.5926 3.7686 2.3025 25.7513 41.4942 10.1238 1.2999 1.9377 2.8273 0.0847 38.1018 76.7567 3.1084 35.6250 13.6262 27.9165 13.1115 9.7423 22.1710 11.0821 16.4136 5.2169 5.0273 9.0972 38.0013 17.2605 40.6545 25.2468
temp: 298.150 k
press: 1.00000 atm
elementType: 17 7 6 6 6 6 6 6 6 6 6 6 6 6 6 6 6 6 6 1 1 1 1 1 1 1 1 1 1 1 1 1 1 1 1 1 1
symmnumber: 1
zpe: 802405.4 jmol-1
zpe.correction: 0.305620 hartree
zpe.thermalcorrener: 0.321955 hartree
zpe.thermalcorrenthalpy: 0.322900 hartree
zpe.thermalcorrgfe: 0.260219 hartree
zpe.sumelectzpe: -1172.043147 hartree
zpe.sumelectthermal: -1172.026812 hartree
zpe.sumelectthermalent: -1172.025868 hartree
zpe.sumelectthermalfe: -1172.088549 hartree
dipole: -2.6848 0.0296 1.7055
dipole: 3.1808
quadrupole: -126.2620 -113.3502 -118.1965
quadrupole: 0.0688 10.0794 -0.1433
quadrupole: -6.9924 5.9193 1.0731 0.0688 10.0794 -0.1433
hfenergy: -1172.3487676 hartree
pointgroup: C01 [X(C17H18Cl1N1)]
dipole: 0.4486179 -0.8802952 0.7680455 debye
polarizability: 211.1503023|-2.5875491|215.9013401|-5.7548591|7.6829547|149.3340987 unknown
InChI: InChI=1S/C17H18ClN/c18-9-10-19-12-16-7-3-1-5-14(16)11-15-6-2-4-8-17(15)13-19/h1-8H,9-13H2
charge 0 multiplicity 1
37 atoms
Cl -2.119811 4.330868 -1.630446
N  -0.637887 1.473267 0.9886
C  -1.539921 0.413476 1.486704
C  0.781708 1.493046 1.400415
C  -1.637911 -0.85451 0.628238
C  1.75823 0.72506 0.500543
C  0.775963 -1.550358 1.238137
C  -0.55723 -1.780794 0.52111
C  1.760456 -0.700412 0.429909
C  -0.981379 2.106674 -0.292234
C  -2.839591 -1.114796 -0.077226
C  2.683668 1.454899 -0.287161
C  -0.719986 -2.93622 -0.281657
C  2.689236 -1.343884 -0.423898
C  -1.646555 3.462833 -0.002531
C  -2.987798 -2.263986 -0.885767
C  3.599006 0.804158 -1.144364
C  -1.919893 -3.182071 -0.98627
C  3.601362 -0.606134 -1.211599
H  -2.55884 0.839471 1.581452
H  -1.214305 0.161615 2.514559
H  0.82846 1.112188 2.438981
H  1.116997 2.548736 1.444209
H  0.594292 -1.080384 2.2223
H  1.241807 -2.532885 1.436785
H  -1.666308 1.469342 -0.883227
H  -0.079359 2.255333 -0.914745
H  -3.674721 -0.408373 0.016425
H  2.689855 2.550743 -0.22063
H  0.105537 -3.655373 -0.3530
H  2.698884 -2.439999 -0.470172
H  -2.587888 3.354447 0.556449
H  -0.968124 4.156831 0.515421
H  -3.924826 -2.44178 -1.424934
H  4.302124 1.38954 -1.747092
H  -2.02025 -4.082055 -1.603131
H  4.3082 -1.127419 -1.866754
