program: Gaussian 09
title: 000205504
version: EM64L-G09RevD.01
frameworkgroup: C1[X(C11H19NO2)]
method: RPBEPBE
basis: SDD
operation: Freq
keyword: #p
keyword: freq=noraman
keyword: PBEPBE/SDD
title: #p freq=noraman PBEPBE/SDD
converged: NO YES NO NO
title: Mulliken charges:
elementType: O O N C C C C C C C C C C C H H H H H H H H H H H H H H H H H H H
charge: -0.286421 -0.249698 -0.106350 -0.069749 -0.012155 -0.435050 -0.368267 -0.472466 -0.368949 -0.424351 -0.400145 -0.389443 0.290158 -0.762288 0.198620 0.258432 0.223496 0.200880 0.170893 0.212008 0.246992 0.203808 0.211240 0.170047 0.192777 0.216138 0.198152 0.217066 0.205613 0.192606 0.245086 0.246398 0.244923
chargesum: 0.00000
title: Mulliken charges with hydrogens summed into heavy atoms:
elementType: O O N C C C C C C C C C C C
charge: -0.286421 -0.249698 -0.106350 0.128871 0.246277 -0.010674 0.014634 -0.021665 0.012338 -0.015436 0.015072 0.008776 0.290158 -0.025880
polarizability: 1.49099743e+02 2.83577075e+00 1.29176251e+02 -1.49522773e+00 2.78073877e+00 1.03749386e+02
1716.lowfreq: -11.9006 -2.7479 -0.0005 -0.0004 0.0002 18.8661 25.4129 43.7854 61.1231
frequency: 25.0657 42.9936 61.0513 81.1898 123.9713 134.2252 198.7940 218.3120 260.0992 293.2728 309.8808 331.0225 384.0573 401.1821 420.5850 439.7622 469.9384 499.8942 526.7393 549.6221 568.3463 636.4032 744.1732 815.3578 820.7847 844.6112 857.5920 880.4077 890.2980 910.3697 935.4694 954.4139 985.2729 998.6200 1011.5314 1032.5384 1039.9170 1062.4800 1067.9563 1086.5337 1122.2364 1126.7442 1136.2164 1151.8319 1178.6365 1184.6875 1200.9970 1206.1162 1233.8137 1252.7292 1263.2413 1275.7693 1288.4584 1300.8596 1307.7486 1334.4096 1340.7101 1341.2866 1343.2570 1347.0108 1352.1030 1363.5525 1380.7273 1389.9748 1451.8794 1453.2752 1454.8878 1458.9562 1461.2199 1461.9483 1468.6684 1473.1062 1479.9368 1645.9274 2808.4013 2815.8101 2832.9035 2969.2083 2981.3062 2985.9958 2986.7407 2995.2990 3007.0323 3018.0356 3025.6463 3029.1477 3036.1343 3050.3748 3055.6663 3060.0950 3067.9604 3095.4499 3142.3610
redmass: 1.1173 7.8894 2.9222 2.7581 2.5865 3.0516 2.9568 4.9251 2.2876 3.3755 1.8632 1.8553 3.2740 3.2235 3.4327 3.4497 3.3196 3.0396 2.0292 1.8618 3.1773 3.9479 3.0698 1.7239 2.7069 1.5986 3.0537 1.4114 2.9496 2.3166 2.2624 2.1875 2.1929 2.1762 1.7389 1.9854 1.6654 1.6325 1.8805 1.9417 2.6027 2.0434 1.9180 1.8613 1.7083 1.8436 1.6606 2.4722 1.4909 1.3512 1.2592 1.2915 1.3788 1.2430 1.3044 1.3440 1.4353 1.3662 1.4064 1.4569 1.4605 1.8645 1.2544 1.4638 1.0771 1.0759 1.0477 1.0883 1.0866 1.0868 1.0959 1.0953 1.0917 9.2794 1.0791 1.0712 1.0709 1.0630 1.0630 1.0617 1.0629 1.0620 1.0366 1.0874 1.0864 1.0844 1.0968 1.1023 1.1004 1.1003 1.1023 1.0974 1.1010
irintensity: 1.5582 1.0440 0.3443 1.2419 1.4762 2.5576 3.7117 3.2772 1.4694 2.7283 2.6437 1.6360 0.4754 2.0309 3.3089 1.0268 3.7591 5.9049 1.1238 1.5243 3.6095 4.8830 9.2211 0.3802 7.2550 3.5991 10.8406 5.9449 6.5203 0.3704 14.5743 41.7624 3.0572 132.7565 1.3541 22.4238 6.4653 6.7113 11.6693 11.9894 15.2843 27.9338 2.6987 3.4283 2.6352 45.5541 92.6709 268.3154 3.8440 1.5962 7.0885 3.6358 20.2850 8.1791 5.0864 4.9500 1.6572 2.4476 7.7488 1.5632 1.6989 2.6178 56.5796 0.5330 12.4475 17.9995 19.8427 13.5252 9.1748 12.1043 3.5258 5.9345 8.8531 187.3481 31.1387 25.1765 218.8342 38.0249 25.7972 36.2948 15.7504 26.4031 3.4926 26.5194 92.9508 10.7644 58.6651 46.9699 32.2253 46.1436 44.0718 8.6931 11.8852
temp: 298.150 k
press: 1.00000 atm
elementType: 8 8 7 6 6 6 6 6 6 6 6 6 6 6 1 1 1 1 1 1 1 1 1 1 1 1 1 1 1 1 1 1 1
symmnumber: 1
zpe: 754312.6 jmol-1
zpe.correction: 0.287303 hartree
zpe.thermalcorrener: 0.301253 hartree
zpe.thermalcorrenthalpy: 0.302197 hartree
zpe.thermalcorrgfe: 0.245469 hartree
zpe.sumelectzpe: -634.658718 hartree
zpe.sumelectthermal: -634.644767 hartree
zpe.sumelectthermalent: -634.643823 hartree
zpe.sumelectthermalfe: -634.700551 hartree
dipole: 1.3628 -0.5134 -2.2552
dipole: 2.6845
quadrupole: -84.0546 -80.4141 -89.3503
quadrupole: 4.3606 6.3531 -1.4659
quadrupole: 0.5517 4.1923 -4.7439 4.3606 6.3531 -1.4659
hfenergy: -634.9460202 hartree
pointgroup: C01 [X(C11H19N1O2)]
dipole: -0.558551 0.12181 -0.8880714 debye
polarizability: 148.4832396|4.5438136|129.5825466|1.2153654|-3.635878|103.9595937 unknown
InChI: InChI=1S/C11H19NO2/c1-9(13)14-11-6-4-8-12-7-3-2-5-10(11)12/h10-11H,2-8H2,1H3
charge 0 multiplicity 1
33 atoms
O  1.745586 0.500028 -0.580745
O  3.266899 0.118019 1.151339
N  -1.69673 -0.78281 0.182496
C  -0.644479 0.127268 -0.361699
C  0.73905 -0.389656 0.090029
C  -0.87298 1.576908 0.125111
C  -1.499737 -2.192523 -0.246168
C  1.0020 -1.847103 -0.315183
C  -3.066998 -0.319398 -0.165042
C  -2.289986 2.083322 -0.215433
C  -0.139926 -2.735267 0.226163
C  -3.341804 1.104743 0.349516
C  2.977595 0.66234 0.061273
C  3.873219 1.576173 -0.749005
H  -0.664208 0.118459 -1.486028
H  0.847598 -0.27275 1.184768
H  -0.10265 2.225596 -0.328616
H  -0.730046 1.601799 1.224388
H  -1.565033 -2.287783 -1.363723
H  -2.321499 -2.796129 0.182652
H  1.981527 -2.174666 0.075589
H  1.035534 -1.911091 -1.421163
H  -3.786786 -1.032476 0.279755
H  -3.224304 -0.340601 -1.277305
H  -2.406846 2.154311 -1.316857
H  -2.44124 3.101025 0.191269
H  -0.009949 -3.776784 -0.122634
H  -0.118585 -2.745822 1.33245
H  -3.292928 1.104097 1.455623
H  -4.364732 1.410494 0.057189
H  3.386884 2.556754 -0.891499
H  4.045473 1.146871 -1.75117
H  4.833579 1.708652 -0.230642
