program: Gaussian 09
title: 000205502
version: EM64L-G09RevD.01
frameworkgroup: C1[X(C16H20N2)]
method: RPBEPBE
basis: SDD
operation: Freq
keyword: #pfreq=noraman
keyword: PBEPBE/SDD
title: #p freq=noraman PBEPBE/SDD
converged: YES YES NO NO
title: Mulliken charges:
elementType: N N C C C C C C C C C C C C C C C C H H H H H H H H H H H H H H H H H H H H
charge: -0.068466 -0.023892 -0.348699 -0.367280 -0.398061 -0.388855 -0.398837 -0.360285 -0.592609 0.455023 0.222370 -0.364391 -0.067765 -0.381993 -0.377750 -0.312541 -0.270111 -0.225172 0.170587 0.203971 0.212728 0.169069 0.192095 0.206220 0.204426 0.193344 0.215211 0.189543 0.206872 0.223737 0.220419 0.233929 0.234160 0.237979 0.235893 0.260913 0.226955 0.231262
chargesum: 0.00000
title: Mulliken charges with hydrogens summed into heavy atoms:
elementType: N N C C C C C C C C C C C C C C C C
charge: -0.068466 -0.023892 0.025859 0.014517 0.000254 0.008916 0.005918 0.070324 -0.138261 0.455023 0.222370 -0.130232 -0.067765 -0.144014 -0.141856 -0.051628 -0.043157 0.006090
polarizability: 2.35366976e+02 -6.02402092e+00 2.10805488e+02 -1.50623737e+01 4.81503869e+00 1.16162207e+02
1716.lowfreq: -6.6705 -2.4986 -0.0003 0.0006 0.0007 10.2031 20.3305 39.7127 50.0942
frequency: 19.8940 39.1003 50.0155 77.7761 124.7944 148.1924 176.2976 198.7710 235.5068 253.3481 281.0650 307.4728 360.2832 386.4852 426.2378 437.9131 444.1951 450.0364 471.2133 506.1051 513.3643 545.8055 569.3044 610.6009 656.4045 703.4694 758.2519 771.2037 786.2023 801.4104 803.2062 808.9467 851.2792 852.3632 857.6155 867.8215 882.5775 908.8002 958.1696 961.1352 966.6823 989.1681 994.8088 996.4333 1020.9578 1025.4744 1048.7478 1056.2124 1077.5893 1084.8934 1104.9560 1122.1910 1142.2655 1151.1837 1156.7039 1167.0490 1175.8651 1218.4157 1234.6011 1250.9547 1258.9414 1262.4402 1266.8727 1282.7900 1286.4390 1301.8888 1329.5169 1339.0195 1340.9550 1343.8475 1350.0984 1363.3882 1379.6243 1386.6210 1388.1119 1431.0184 1450.2252 1451.9485 1459.6601 1460.7956 1467.3907 1474.5406 1479.1593 1488.7007 1510.4402 1552.8869 1584.7989 1621.1218 2814.1714 2828.5580 2861.1796 2968.3083 2985.8460 2986.4707 2999.5691 3020.1761 3025.1235 3026.3596 3035.8373 3046.6095 3055.7261 3066.6965 3117.2851 3126.9539 3139.6696 3145.9943 3155.8358 3171.1266
redmass: 3.6427 3.4813 4.3657 3.4039 3.2863 3.9439 4.3021 2.6919 1.8982 3.4845 2.6763 2.2391 3.0122 1.9154 3.5211 3.1156 3.4037 2.9010 3.1335 4.5940 5.9461 2.0874 4.8309 3.5712 3.5517 4.5627 2.7231 1.4605 1.4353 2.6261 1.5280 4.2117 1.8653 2.9796 1.4623 1.8286 1.9556 2.3300 1.3065 1.4070 1.4076 2.5520 2.1329 1.4456 2.2366 3.6208 2.1070 2.0404 2.7509 1.4329 2.1406 2.5584 1.3998 1.3055 2.2777 1.2623 1.1960 2.0015 1.5968 1.8037 1.3656 1.4173 1.2401 1.4090 1.4250 1.4627 1.2794 2.8341 1.4465 1.4539 1.4833 1.4051 2.1727 2.6147 1.4099 2.7693 1.0915 2.7319 1.0871 1.0886 1.0879 1.0974 1.1049 1.1181 3.5421 6.7610 6.7143 6.4187 1.0712 1.0702 1.0697 1.0626 1.0617 1.0613 1.0628 1.0874 1.0851 1.0893 1.0949 1.1034 1.1037 1.1011 1.0884 1.0850 1.0897 1.0958 1.0957 1.0992
irintensity: 0.2768 0.0367 0.3838 0.2744 0.3826 0.0730 5.4327 1.8092 0.7720 0.1563 0.8338 3.9935 0.4529 4.5071 4.4944 8.6165 3.6864 0.1720 0.2417 1.9266 1.0693 0.6742 5.4578 2.8282 1.2401 0.3959 24.5395 49.0231 6.6618 6.6878 0.8321 0.3183 14.5177 9.9356 10.3249 13.7981 6.5174 3.1102 3.2645 0.3041 1.6851 8.4796 7.5735 3.2318 6.4668 20.8195 8.7312 10.9190 8.6423 11.3147 55.3466 5.0929 2.6749 7.4731 37.7186 3.3316 2.4320 1.6904 7.2268 9.3260 3.2621 1.4441 5.8195 2.3841 2.8579 12.8556 10.0700 21.6235 8.4570 6.6812 1.1843 6.0339 8.7344 11.7371 1.5089 11.9447 7.3908 2.0929 14.4755 2.9108 11.2315 4.2684 1.6202 15.1424 28.5221 16.6020 38.5992 3.9135 50.8793 101.3113 119.2238 37.1577 34.1480 37.6461 14.4044 6.9004 88.7913 50.0687 41.7355 19.3405 90.3502 24.6307 20.5551 0.1517 16.2154 32.6478 25.1205 20.1646
temp: 298.150 k
press: 1.00000 atm
elementType: 7 7 6 6 6 6 6 6 6 6 6 6 6 6 6 6 6 6 1 1 1 1 1 1 1 1 1 1 1 1 1 1 1 1 1 1 1 1
symmnumber: 1
zpe: 853766.0 jmol-1
zpe.correction: 0.325182 hartree
zpe.thermalcorrener: 0.340626 hartree
zpe.thermalcorrenthalpy: 0.341571 hartree
zpe.thermalcorrgfe: 0.281052 hartree
zpe.sumelectzpe: -729.873993 hartree
zpe.sumelectthermal: -729.858549 hartree
zpe.sumelectthermalent: -729.857605 hartree
zpe.sumelectthermalfe: -729.918123 hartree
dipole: 3.1307 1.3472 0.0071
dipole: 3.4083
quadrupole: -115.7569 -99.0924 -110.7263
quadrupole: -5.2032 0.8051 0.5624
quadrupole: -7.2317 9.4328 -2.2011 -5.2032 0.8051 0.5624
hfenergy: -730.1991751 hartree
pointgroup: C01 [X(C16H20N2)]
dipole: 1.2267823 0.5411908 -0.0146609 debye
polarizability: 235.3157515|-6.0931649|210.8496729|-15.6038963|2.7681151|116.1692478 unknown
InChI: InChI=1S/C16H20N2/c1-4-11-18(12-5-1)13-9-14-8-10-17-16-7-3-2-6-15(14)16/h2-3,6-8,10H,1,4-5,9,11-13H2
charge 0 multiplicity 1
38 atoms
N  2.728166 -0.325543 0.036774
N  -3.779671 -1.484283 0.272074
C  3.073118 0.965488 -0.612126
C  3.602008 -0.587507 1.211682
C  4.54378 0.982148 -1.077401
C  5.08772 -0.626167 0.800849
C  5.496767 0.691541 0.104432
C  1.290852 -0.43591 0.373724
C  0.40804 -0.709412 -0.87912
C  -1.045536 -0.943513 -0.511815
C  -1.944541 0.146015 -0.200085
C  -1.55607 -2.245626 -0.42401
C  -3.305472 -0.177941 0.188765
C  -1.564227 1.528121 -0.260359
C  -2.912762 -2.4685 -0.032527
C  -4.220104 0.877213 0.505854
C  -2.477985 2.53829 0.050874
C  -3.815724 2.21203 0.440145
H  2.90037 1.823077 0.093777
H  2.407995 1.118262 -1.481647
H  3.305014 -1.556943 1.653825
H  3.463171 0.197429 2.002713
H  4.773499 1.9648 -1.532778
H  4.677445 0.209427 -1.858792
H  5.242457 -1.475156 0.107181
H  5.711961 -0.805679 1.697346
H  6.544589 0.637095 -0.246534
H  5.442891 1.525715 0.8348
H  0.912769 0.472007 0.908809
H  1.167983 -1.287173 1.06965
H  0.496522 0.132515 -1.590893
H  0.821028 -1.6007 -1.383275
H  -0.917124 -3.104792 -0.656317
H  -0.545222 1.795944 -0.55963
H  -3.302342 -3.491914 0.032735
H  -5.235716 0.5906 0.795704
H  -2.171621 3.588894 -0.003009
H  -4.521227 3.014149 0.683304
