program: Gaussian 09
title: 000205490
version: EM64L-G09RevD.01
frameworkgroup: C1[X(C15H21NO)]
method: RPBEPBE
basis: SDD
operation: Freq
keyword: #p
keyword: freq=noraman
keyword: PBEPBE/SDD
title: #p freq=noraman PBEPBE/SDD
converged: NO YES NO NO
title: Mulliken charges:
elementType: O N C C C C C C C C C C C C C C C H H H H H H H H H H H H H H H H H H H H H
charge: -0.226302 -0.065779 -0.399430 -0.364874 -0.377890 -0.401557 -0.415013 -0.402196 -0.382583 -0.524457 0.128682 0.278579 -0.340515 -0.346593 -0.248419 -0.230155 -0.224082 0.192820 0.208087 0.214304 0.174866 0.207189 0.194623 0.208830 0.199181 0.202149 0.195111 0.199025 0.197149 0.206707 0.239333 0.229087 0.251820 0.249078 0.277401 0.230081 0.232821 0.232927
chargesum: 0.00000
title: Mulliken charges with hydrogens summed into heavy atoms:
elementType: O N C C C C C C C C C C C C C C C
charge: -0.226302 -0.065779 0.001477 0.024295 0.023922 0.006453 -0.017753 -0.006022 0.063456 -0.043550 0.128682 0.278579 -0.091438 -0.069192 -0.018338 0.002666 0.008845
polarizability: 2.33778255e+02 -9.59799848e+00 1.55588305e+02 2.69651423e+00 1.31561206e+01 1.18139506e+02
1716.lowfreq: -8.7990 -5.2726 -0.0006 -0.0004 -0.0003 6.7885 21.8108 23.1910 39.5650
frequency: 20.8046 23.0376 39.0838 58.3530 82.8075 110.4823 155.8647 160.6960 185.5729 191.1557 247.6864 275.6422 312.2530 330.7103 382.6162 401.0689 410.0945 416.5287 428.2773 479.9442 500.7713 509.1290 567.9372 613.4747 641.0680 697.9981 703.7544 752.7706 775.7491 795.9081 807.9843 816.1278 835.7410 855.2228 860.2776 941.7781 943.3167 954.0123 972.8836 980.4451 989.7301 991.6100 993.2962 1009.0913 1020.9235 1026.2969 1053.3579 1078.6301 1085.8100 1089.1310 1114.9894 1123.0962 1137.8365 1172.4385 1174.4929 1187.2631 1195.7795 1201.6345 1220.9197 1239.1286 1265.3927 1275.1726 1296.9896 1303.9255 1311.8656 1321.2553 1331.6308 1336.0769 1342.6499 1353.3652 1359.3641 1361.7175 1387.2587 1400.9369 1432.4576 1436.2534 1453.3145 1457.0899 1462.2618 1464.4337 1469.7612 1478.9666 1480.5373 1493.0534 1568.4584 1598.1149 1612.4819 2846.5404 2892.7769 2956.3754 2960.9177 2964.1292 2967.8139 2972.8201 2974.5454 2989.4617 3014.1655 3019.1351 3019.9523 3029.2292 3034.3802 3040.7929 3049.1287 3128.0434 3137.8076 3149.3343 3158.3618 3168.8505
redmass: 4.3719 3.5729 3.5516 4.8798 3.4095 2.3158 3.8962 2.0542 4.1429 4.0367 1.8651 4.1193 2.1245 3.6103 2.4695 2.8285 3.6470 3.3462 2.6028 2.2430 2.2755 2.3269 2.2509 6.4240 5.5509 1.8394 3.1567 1.4769 4.1447 1.6748 1.4264 3.0157 2.2276 1.5590 1.2483 2.3194 1.4059 2.1791 2.5918 1.9445 5.4933 1.3818 2.5931 1.3937 1.9877 2.0874 2.0895 2.1655 1.8860 1.9152 2.3172 1.7142 1.7912 1.1128 1.4206 1.1326 1.5074 1.3728 1.7886 1.4312 1.2446 1.1768 1.4625 1.2939 1.4103 1.5261 1.3607 1.4247 1.2655 1.4288 1.3810 1.4213 9.1925 1.4053 1.2412 1.8458 1.0847 1.0864 1.0798 1.0909 1.0932 1.8680 1.1776 1.0841 6.9188 6.7909 6.4464 1.0717 1.0709 1.0592 1.0642 1.0671 1.0619 1.0733 1.0606 1.0771 1.0946 1.1009 1.0946 1.1019 1.0956 1.1002 1.0918 1.0850 1.0880 1.0923 1.0960 1.1013
irintensity: 1.2739 0.2755 0.3327 1.6123 2.0180 1.5689 0.3906 0.2241 3.1900 1.6950 1.0704 10.2426 2.2586 0.4077 0.3690 0.0317 0.2018 0.4153 8.2505 3.9776 8.4771 1.7126 5.3474 0.1239 15.5046 47.5108 2.9957 60.3739 2.8069 10.8193 3.1139 13.2448 7.2145 0.1729 0.8040 40.8981 1.3857 6.1926 19.3300 0.5858 0.4408 0.4413 22.9624 0.7708 8.2622 1.6267 0.1728 1.9126 22.0568 16.1316 9.9370 10.7186 24.2764 7.1381 10.0974 28.3641 13.7210 10.0335 53.8732 4.3770 35.5246 1.8451 42.4477 24.7345 17.0283 54.6880 7.5542 0.0084 3.2136 0.6542 21.4557 53.6684 2.5397 2.7155 10.2595 24.8402 11.0774 7.8030 6.6504 10.4025 11.1965 3.4020 12.4269 12.2003 93.9824 37.2560 10.5418 80.5904 56.7255 29.0751 32.9317 28.8400 27.1637 20.8880 29.9261 76.3159 79.7152 44.0859 5.5634 57.7503 75.0446 67.9981 32.9177 0.2084 6.2889 17.2154 22.5574 23.2607
temp: 298.150 k
press: 1.00000 atm
elementType: 8 7 6 6 6 6 6 6 6 6 6 6 6 6 6 6 6 1 1 1 1 1 1 1 1 1 1 1 1 1 1 1 1 1 1 1 1 1
symmnumber: 1
zpe: 860556.6 jmol-1
zpe.correction: 0.327769 hartree
zpe.thermalcorrener: 0.344121 hartree
zpe.thermalcorrenthalpy: 0.345065 hartree
zpe.thermalcorrgfe: 0.281547 hartree
zpe.sumelectzpe: -712.854840 hartree
zpe.sumelectthermal: -712.838488 hartree
zpe.sumelectthermalent: -712.837543 hartree
zpe.sumelectthermalfe: -712.901062 hartree
dipole: 0.3137 -2.5758 -0.4293
dipole: 2.6301
quadrupole: -84.8912 -104.4577 -105.7228
quadrupole: -5.7851 -1.3310 -0.5629
quadrupole: 13.4660 -6.1004 -7.3656 -5.7851 -1.3310 -0.5629
hfenergy: -713.1826088 hartree
pointgroup: C01 [X(C15H21N1O1)]
dipole: 0.1603152 0.958708 0.3548347 debye
polarizability: 234.2728258|7.6170141|148.811385|-2.2789241|19.0536154|124.4218557 unknown
InChI: InChI=1S/C15H21NO/c17-15(14-8-4-3-5-9-14)10-13-16-11-6-1-2-7-12-16/h3-5,8-9H,1-2,6-7,10-13H2
charge 0 multiplicity 1
38 atoms
O  1.332048 -1.87896 -1.099533
N  -2.178616 -0.06232 0.53804
C  -2.573237 1.241525 -0.05325
C  -3.278798 -1.028416 0.813772
C  -3.605287 1.214118 -1.223139
C  -4.61962 -0.397781 1.253955
C  -5.069096 1.267213 -0.722943
C  -5.532709 0.023921 0.073671
C  -1.048853 -0.729083 -0.155553
C  0.304045 -0.067114 0.166519
C  1.497118 -0.816571 -0.427851
C  2.882127 -0.271609 -0.19523
C  3.125553 0.889159 0.587903
C  3.983567 -0.952267 -0.782641
C  4.443205 1.357836 0.778705
C  5.298223 -0.483421 -0.593711
C  5.531806 0.674179 0.188397
H  -1.643313 1.732398 -0.395824
H  -2.980994 1.893141 0.745963
H  -2.915749 -1.71188 1.607823
H  -3.49061 -1.672152 -0.078764
H  -3.439157 0.315833 -1.852656
H  -3.425211 2.091478 -1.876503
H  -4.433018 0.453549 1.93778
H  -5.162014 -1.158874 1.848824
H  -5.752056 1.407183 -1.584998
H  -5.181507 2.169771 -0.085801
H  -6.555125 0.217225 0.45677
H  -5.617328 -0.840314 -0.617595
H  -1.189257 -0.778949 -1.261996
H  -1.006403 -1.778794 0.186435
H  0.329176 0.981889 -0.191452
H  0.414255 -0.007949 1.268272
H  2.292836 1.426802 1.053383
H  3.775258 -1.845915 -1.380669
H  4.622934 2.251951 1.38571
H  6.140425 -1.01423 -1.05105
H  6.554182 1.039733 0.336837
