program: Gaussian 09
title: 000205481
version: EM64L-G09RevD.01
frameworkgroup: C1[X(C4H4ClNS)]
method: RPBEPBE
basis: SDD
operation: Freq
keyword: #p
keyword: freq=noraman
keyword: PBEPBE/SDD
title: #p freq=noraman PBEPBE/SDD
converged: NO YES NO NO
title: Mulliken charges:
elementType: Cl S N C C C C H H H H
charge: -0.036587 0.235284 0.012013 -0.059582 -0.629871 -0.228382 -0.418830 0.281122 0.285538 0.287204 0.272088
chargesum: 0.00000
title: Mulliken charges with hydrogens summed into heavy atoms:
elementType: Cl S N C C C C
charge: -0.036587 0.235284 0.012013 -0.059582 -0.063210 0.058823 -0.146742
polarizability: 9.65661545e+01 3.05202656e+00 7.67313393e+01 6.15169670e-01 -7.87531816e-02 3.17226539e+01
1716.lowfreq: -6.6428 0.0023 0.0025 0.0028 5.0516 7.8433 17.2029 160.2571 210.5773
frequency: 15.0272 160.2505 210.5741 279.7769 459.8755 529.2907 593.8849 635.9941 674.0726 695.9937 750.1901 796.4242 843.1439 917.5829 1093.9404 1099.6693 1153.0101 1204.4226 1262.0034 1287.6470 1441.2548 1451.9348 1532.2403 3041.4706 3110.7894 3220.0612 3228.4315
redmass: 3.7503 8.7665 3.1384 15.8593 4.0529 9.5922 4.4878 8.8962 7.1519 6.7394 1.2127 5.7579 1.3414 1.5280 3.4113 2.8616 1.0896 1.1763 1.6021 1.3840 1.3804 3.5508 5.8604 1.0563 1.1091 1.0946 1.0980
irintensity: 3.5216 0.7042 4.7775 0.8817 3.1615 17.0034 11.0224 13.3858 28.1778 16.1847 50.3155 43.3733 20.9506 6.4326 5.9495 4.1987 0.8965 23.7259 5.9425 12.4021 28.2368 30.2841 1.9668 11.3695 4.7120 1.3717 1.0815
temp: 298.150 k
press: 1.00000 atm
elementType: 17 16 7 6 6 6 6 1 1 1 1
symmnumber: 1
zpe: 189542.1 jmol-1
zpe.correction: 0.072193 hartree
zpe.thermalcorrener: 0.078972 hartree
zpe.thermalcorrenthalpy: 0.079917 hartree
zpe.thermalcorrgfe: 0.038732 hartree
zpe.sumelectzpe: -1067.155803 hartree
zpe.sumelectthermal: -1067.149023 hartree
zpe.sumelectthermalent: -1067.148079 hartree
zpe.sumelectthermalfe: -1067.189264 hartree
dipole: -0.6289 -2.4858 0.1746
dipole: 2.5701
quadrupole: -54.6397 -56.5616 -56.4137
quadrupole: 1.2004 0.5721 -0.1212
quadrupole: 1.2320 -0.6900 -0.5420 1.2004 0.5721 -0.1212
hfenergy: -1067.2279954 hartree
pointgroup: C01 [X(C4H4Cl1N1S1)]
dipole: 0.0181722 -0.9750224 0.2672137 debye
dipolederiv: -0.4433765 -0.1285417 -0.0039747 -0.254096 -0.2738029 0.0094111 0.0410752 0.0238234 -0.1480235 -0.2856685 0.1634455 -0.0875172 0.1686068 -0.402113 0.1172638 -0.0810045 0.1257812 0.1087688 -0.2203212 -0.0815849 0.0082067 0.229416 -0.694099 0.1236758 -0.0353161 0.0810662 -0.1887942 0.1565064 0.1565832 0.0304734 0.0698816 0.1632281 -0.0423135 0.0686626 -0.0414942 -0.1998336 0.5768819 0.2088672 -0.0185465 0.3281694 0.3563728 -0.0095523 -0.0816169 -0.0170659 0.2418879 0.0123435 0.0591504 0.0047218 0.0731568 0.0331769 -0.0097203 -0.0203755 -0.0214155 -0.0946948 0.1454017 -0.2357511 0.0921505 -0.508986 0.7104334 -0.2316668 0.1374511 -0.1969964 -0.1332488 -0.0206084 -0.0348394 0.0199348 0.0037333 -0.0542089 -0.05855 0.0561066 -0.0573507 0.0610458 -0.0284629 -0.0504332 -0.0106986 -0.062113 0.0273451 0.0615441 -0.0457524 0.0612928 -0.0403426 0.0901004 -0.0299155 -0.010925 -0.0818796 0.0551978 0.0136587 0.000802 0.0255044 0.2002726 0.0172035 -0.0269804 -0.0238252 0.0341107 0.0784698 0.0262493 -0.0400322 0.0168546 0.1929624 unknown
polarizability: 92.3841321|9.1807065|78.400848|6.6385744|-8.0052104|34.2351676 unknown
InChI: InChI=1S/C4H4ClNS/c5-1-4-2-6-3-7-4/h2-3H,1H2
charge 0 multiplicity 1
11 atoms
Cl 2.866194 0.985555 0.246664
S  -0.901882 -1.53828 0.285259
N  -1.681227 0.952621 -0.269366
C  0.324644 -0.200444 0.249057
C  1.761269 -0.51083 0.546353
C  -0.294467 1.001032 -0.057344
C  -2.157731 -0.266669 -0.134692
H  2.162561 -1.303945 -0.103673
H  1.923387 -0.775578 1.603384
H  0.228723 1.951823 -0.148588
H  -3.201772 -0.557186 -0.246854
