program: Gaussian 09
title: 000205462
version: EM64L-G09RevD.01
frameworkgroup: C1[X(C22H32O3)]
method: RPBEPBE
basis: SDD
operation: Freq
keyword: #pfreq=noraman
keyword: PBEPBE/SDD
title: #p freq=noraman PBEPBE/SDD
converged: YES YES NO NO
title: Mulliken charges:
elementType: O O O C C C C C C C C C C C C C C C C C C C C C C H H H H H H H H H H H H H H H H H H H H H H H H H H H H H H H H
charge: -0.316379 -0.236483 -0.255391 0.314952 -0.155482 -0.134760 0.400730 -0.075058 -0.510596 -0.554027 -0.521498 -0.522423 -0.241355 -0.491640 -0.857302 -0.515905 -0.640237 0.535529 -0.464770 -0.702472 -0.543115 -0.577712 0.179124 0.283843 -0.770355 0.258984 0.226490 0.226181 0.233665 0.202444 0.216357 0.231368 0.206565 0.221796 0.229255 0.260623 0.230687 0.226191 0.220986 0.229247 0.234237 0.226290 0.262792 0.218828 0.218534 0.237915 0.214568 0.222903 0.223240 0.208997 0.220341 0.243496 0.224762 0.256817 0.246195 0.246686 0.245342
chargesum: 0.00000
title: Mulliken charges with hydrogens summed into heavy atoms:
elementType: O O O C C C C C C C C C C C C C C C C C C C C C C
charge: -0.316379 -0.236483 -0.255391 0.314952 0.103502 0.091730 0.400730 0.151123 -0.074487 -0.106302 -0.093137 -0.032545 -0.010668 -0.044463 -0.167527 -0.034285 -0.183789 0.535529 -0.027299 -0.049894 -0.074857 -0.320895 0.179124 0.283843 -0.032132
polarizability: 3.06474331e+02 7.90830989e+00 2.13451955e+02 -1.59206044e+01 -1.15601733e+00 2.00116957e+02
1716.lowfreq: -13.8284 -7.3652 -5.7464 -0.0008 0.0001 0.0005 9.4570 26.0536 42.1818
frequency: -13.2690 25.8794 42.1680 57.5375 74.3702 80.9590 89.1304 101.3339 119.9729 146.9423 152.5764 168.2345 189.0652 197.1044 208.7462 220.1000 236.1471 244.3814 250.7007 268.1167 286.3712 312.4442 329.2177 338.8550 346.4153 361.8536 378.8482 386.9940 423.7756 426.3382 448.9343 456.4650 470.2842 471.8457 496.6970 519.9553 528.5013 555.2078 571.1765 592.4441 615.7977 632.5994 652.4710 683.2613 701.8982 742.8846 754.9474 788.8253 807.9650 815.3432 817.1527 836.8418 852.9276 864.0426 897.8610 901.2828 902.4318 919.7133 943.0051 957.1905 964.7387 968.2218 984.4685 997.5119 1006.1900 1011.2123 1013.8174 1018.3405 1036.2416 1042.9230 1043.8004 1062.4705 1070.5154 1084.3740 1092.9905 1100.2754 1105.8165 1110.5610 1117.4322 1139.1159 1150.6199 1159.3786 1164.3085 1168.4340 1183.2133 1190.4124 1202.9426 1208.0447 1214.8200 1224.4543 1229.1143 1235.7281 1251.5009 1266.6817 1269.9144 1280.1446 1284.5185 1291.8657 1295.6527 1301.8850 1311.0649 1317.2495 1320.1569 1325.2679 1329.6083 1333.2473 1342.4826 1347.4734 1352.4775 1353.8653 1354.9794 1372.2145 1381.0295 1390.8016 1396.6866 1441.3466 1453.4438 1455.0299 1458.3584 1459.5265 1464.5426 1467.0134 1469.1121 1469.5965 1471.6280 1477.9317 1484.7275 1487.8021 1492.6589 1494.5448 1585.8895 1625.9613 1627.5149 2898.2101 2927.2903 2940.2427 2942.5395 2957.8823 2966.9193 2969.8802 2974.2110 2977.4513 2986.7114 2987.9959 2990.1489 2995.4777 3001.9383 3005.4277 3018.8621 3030.1336 3036.8013 3040.7351 3049.3265 3052.0173 3053.3890 3058.7324 3064.5880 3074.5085 3080.3571 3087.6448 3089.1792 3093.7758 3094.7405 3119.9885 3135.0972
redmass: 1.0749 6.2167 3.3743 4.1063 5.4497 2.5872 3.3838 3.0477 3.2001 2.8167 3.0068 2.5277 3.6260 2.1873 1.6555 1.7016 2.5506 1.6077 3.3386 2.7879 2.0974 2.9026 3.7241 2.8869 2.5354 2.6092 3.3713 2.8481 3.0173 3.2186 3.2993 3.6890 2.6243 4.4047 3.1258 2.8411 3.0444 2.3440 3.1766 3.6367 2.7417 2.9866 3.8229 2.8817 2.4288 4.2858 2.2573 1.2588 2.3267 1.9502 2.3414 1.7841 1.9555 2.4829 1.6382 2.6347 2.2172 1.9732 1.7538 1.8161 2.9662 2.2076 2.1680 1.7542 2.0534 1.9448 2.0796 2.2387 2.6635 2.4193 1.6766 1.7609 2.0573 1.9278 2.4441 2.3821 1.9293 1.6455 1.9869 1.7977 1.8313 1.8760 1.7967 1.8640 1.6000 2.2536 2.0725 1.6478 1.9783 1.4630 1.3588 1.4815 1.5083 1.6016 1.4595 1.3687 1.5220 1.3585 1.3900 1.3720 1.5498 1.4538 1.4753 1.4028 1.3284 1.4856 1.4763 1.8654 1.4916 1.5287 1.5970 1.5284 1.2236 1.2047 1.2024 1.0832 1.0895 1.0655 1.0506 1.0644 1.0752 1.0832 1.0779 1.0849 1.0763 1.0575 1.0730 1.0688 1.0603 1.0626 9.9253 9.7502 7.8014 1.0790 1.0807 1.0779 1.0697 1.0806 1.0650 1.0676 1.0633 1.0618 1.0471 1.0488 1.0433 1.0583 1.0627 1.0363 1.0670 1.0964 1.0940 1.0998 1.0975 1.0997 1.0981 1.1009 1.0951 1.0985 1.0988 1.0987 1.0975 1.0972 1.0977 1.0914 1.1012
irintensity: 1.4062 2.5023 0.8883 1.0127 3.8828 0.7295 0.3367 0.5797 1.0613 0.7594 0.8573 1.6498 2.8694 1.7495 0.0773 0.3423 2.3696 1.4547 4.2832 0.3927 0.1733 0.9020 2.4609 3.3695 1.3759 1.5028 0.4212 0.8246 0.2955 0.6186 2.1213 5.6536 2.9396 3.3113 2.2182 1.8819 2.4673 0.7205 1.1844 2.6631 1.6694 2.7630 0.7284 6.6617 4.1088 6.0757 6.3942 3.4799 2.1401 0.8640 1.2261 2.7102 8.5134 8.2262 9.5605 79.2515 28.7797 2.0950 12.4904 28.7016 10.3135 13.2940 19.2680 31.0082 1.5517 0.3052 3.3940 1.3479 1.0142 3.3098 7.6770 3.5114 1.9202 1.9401 1.6222 18.8876 11.2075 13.1265 1.7473 32.2456 48.1454 3.7902 17.6770 39.1710 22.6932 115.3616 152.1035 53.3204 6.9274 16.0194 8.4218 2.9985 4.0651 49.6778 10.9865 0.9356 1.9659 1.9252 2.0363 0.9051 4.7325 2.0019 12.0080 4.4931 1.9192 1.5715 2.1975 7.0901 2.0126 1.6864 8.2768 5.8300 48.6650 26.2254 17.1695 14.0104 15.2556 11.8025 14.2080 5.3942 10.1719 2.8503 18.0570 13.0353 6.1871 8.3375 10.1661 22.3460 4.1067 5.3065 172.6378 281.2742 126.6359 7.9858 3.3259 0.8582 22.4499 17.8338 33.0825 8.4684 45.8746 45.8991 28.4558 4.6389 39.0663 49.7519 13.4734 3.6577 36.7229 34.1729 45.1077 39.5286 39.6576 22.8440 2.4508 37.6171 21.2681 28.1739 37.8751 76.2108 10.0218 5.7572 20.7454 10.4366 11.4646
temp: 298.150 k
press: 1.00000 atm
elementType: 8 8 8 6 6 6 6 6 6 6 6 6 6 6 6 6 6 6 6 6 6 6 6 6 6 1 1 1 1 1 1 1 1 1 1 1 1 1 1 1 1 1 1 1 1 1 1 1 1 1 1 1 1 1 1 1 1
symmnumber: 1
zpe: 1298107.5 jmol-1
zpe.correction: 0.494423 hartree
zpe.thermalcorrener: 0.518151 hartree
zpe.thermalcorrenthalpy: 0.519095 hartree
zpe.thermalcorrgfe: 0.442590 hartree
zpe.sumelectzpe: -1081.296999 hartree
zpe.sumelectthermal: -1081.273271 hartree
zpe.sumelectthermalent: -1081.272327 hartree
zpe.sumelectthermalfe: -1081.348832 hartree
dipole: 3.2617 -0.3490 -2.4935
dipole: 4.1205
quadrupole: -215.3906 -145.5213 -145.7256
quadrupole: -7.3451 12.2621 -1.1849
quadrupole: -46.5114 23.3578 23.1536 -7.3451 12.2621 -1.1849
hfenergy: -1081.791422 hartree
pointgroup: C01 [X(C22H32O3)]
dipole: -1.2664096 0.3710903 -0.9415606 debye
polarizability: 306.2531875|2.3143176|212.2158827|18.3804866|3.5068722|201.5741718 unknown
InChI: InChI=1S/C22H32O3/c1-4-22(25-14(2)23)12-10-20-19-7-5-15-13-16(24)6-8-17(15)18(19)9-11-21(20,22)3/h13,17-20H,4-12H2,1-3H3
charge 0 multiplicity 1
57 atoms
O  -3.130067 0.133186 1.029371
O  6.701466 -0.0061 1.414517
O  -5.287916 -0.761405 1.27288
C  -1.627313 0.480826 -0.85548
C  -0.883289 -0.842339 -0.467935
C  0.622553 -0.823349 -0.79343
C  -3.114558 0.086498 -0.498358
C  1.291985 0.359747 -0.028919
C  -0.975748 1.640926 -0.058997
C  -1.761053 -1.963176 -1.074961
C  0.559199 1.703212 -0.295629
C  -3.216663 -1.407465 -0.967282
C  2.825592 0.469564 -0.340412
C  1.319987 -2.150072 -0.423454
C  -1.557971 0.77679 -2.38015
C  -4.267421 0.958244 -1.04565
C  2.827341 -2.093125 -0.768636
C  3.527186 -0.880944 -0.182033
C  3.500447 1.567192 0.525008
C  -4.339348 2.412443 -0.532842
C  5.041057 1.52552 0.460208
C  4.756964 -1.004444 0.415148
C  5.582386 0.145904 0.834251
C  -4.231268 -0.295347 1.763513
C  -3.977663 -0.122155 3.250194
H  -0.971443 -0.920727 0.637736
H  0.759113 -0.665504 -1.8863
H  1.195101 0.130268 1.057185
H  -1.174752 1.489871 1.017786
H  -1.417634 2.616223 -0.337079
H  -1.647497 -2.920302 -0.536766
H  -1.483491 -2.149742 -2.130503
H  0.772911 2.029223 -1.334782
H  0.972101 2.489375 0.363726
H  -3.740252 -1.44589 -1.939949
H  -3.838901 -1.981224 -0.263137
H  2.912949 0.759561 -1.415134
H  0.853436 -2.995227 -0.963984
H  1.189406 -2.345451 0.660721
H  -0.51486 0.864479 -2.727108
H  -2.038715 -0.011375 -2.986443
H  -2.059265 1.734128 -2.611868
H  -5.212932 0.440925 -0.80415
H  -4.185494 0.959183 -2.149047
H  2.919332 -2.039165 -1.876151
H  3.343106 -3.018949 -0.45432
H  3.179083 1.429468 1.577815
H  3.149215 2.565927 0.209391
H  -4.350913 2.450756 0.571001
H  -3.486856 3.022065 -0.880566
H  -5.26546 2.89413 -0.895129
H  5.500758 2.280023 1.122426
H  5.382194 1.750989 -0.572296
H  5.212786 -1.993719 0.553325
H  -4.748474 0.544225 3.675543
H  -2.979388 0.294853 3.446544
H  -4.079451 -1.099128 3.754187
