program: Gaussian 09
title: 000213568
version: EM64L-G09RevD.01
frameworkgroup: C1[X(C12H19N5)]
method: RPBEPBE
basis: SDD
operation: Freq
keyword: #pfreq=noraman
keyword: PBEPBE/SDD
title: #p freq=noraman PBEPBE/SDD
converged: YES YES NO NO
title: Mulliken charges:
elementType: N N N N N C C C C C C C C C C C C H H H H H H H H H H H H H H H H H H H
charge: -0.120721 -0.120623 -0.115434 -0.109513 -0.109046 -0.450457 -0.451154 -0.450388 -0.451152 -0.358542 -0.358612 -0.358594 -0.358613 0.061661 0.061327 0.049441 -0.753997 0.220614 0.226849 0.220792 0.226329 0.226856 0.220604 0.226352 0.220783 0.252890 0.225572 0.244966 0.225309 0.225524 0.252964 0.225348 0.244941 0.237343 0.233358 0.237024
chargesum: 0.00000
title: Mulliken charges with hydrogens summed into heavy atoms:
elementType: N N N N N C C C C C C C C C C C C
charge: -0.120721 -0.120623 -0.115434 -0.109513 -0.109046 -0.002995 -0.004034 -0.002927 -0.004017 0.119919 0.111663 0.119893 0.111677 0.061661 0.061327 0.049441 -0.046273
polarizability: 2.31170831e+02 4.72872526e-02 1.78198289e+02 4.81913960e-03 7.68576602e-02 1.03485084e+02
1716.lowfreq: -50.6276 -5.0166 -4.0902 0.0006 0.0006 0.0006 3.5255 39.7655 49.5996
frequency: -50.6226 39.7400 49.5940 77.1682 77.2280 84.0063 142.3634 154.9820 161.6391 204.9023 229.4828 240.1452 242.7131 259.9556 288.1122 288.1950 387.6480 412.1919 558.2221 563.1244 567.5286 592.2201 607.5462 670.4538 710.3409 713.1399 789.1869 791.7499 839.3182 855.6580 861.4607 863.2251 889.3576 890.7472 911.6233 912.6403 915.5234 917.6745 964.2356 967.1322 996.3132 1038.2162 1050.7072 1051.2358 1079.3615 1107.4322 1121.1406 1127.5040 1155.9654 1158.1328 1168.7108 1170.0778 1183.5976 1185.5776 1212.2552 1214.5172 1234.2219 1239.2234 1247.8990 1298.6109 1299.3771 1309.4454 1309.5679 1313.2634 1328.7859 1333.1408 1335.5997 1353.5372 1388.6971 1434.9267 1438.1298 1462.0007 1468.3019 1468.3515 1471.5803 1473.6076 1475.5109 1490.8565 1491.7716 1493.5524 1499.4671 1527.4294 1585.0812 2976.5768 2977.8875 2981.7732 2982.0635 2992.9669 3007.2782 3007.4562 3008.1903 3008.2525 3056.9293 3057.0571 3067.9636 3068.1008 3077.2151 3077.3743 3083.5612 3090.5510 3090.6743 3127.5209
redmass: 1.0120 3.0831 2.8892 2.6167 2.8795 3.6608 2.8214 4.1179 4.0967 4.3528 3.0805 1.8147 1.7954 4.1530 4.5573 3.1441 4.8975 4.6940 5.6256 1.9843 1.8663 4.0952 3.7945 4.2960 11.0182 2.5522 9.3528 2.1344 1.7388 2.2014 1.9500 2.0134 4.9492 9.8396 2.4540 2.2189 1.3491 1.4735 1.7551 1.7787 1.7978 2.7958 1.6376 1.9091 2.0201 1.7389 1.7497 2.2526 1.6779 1.4912 1.7474 1.5423 2.6855 2.7916 1.3115 1.2770 1.3716 1.4081 5.6068 1.3361 1.3523 1.2458 1.2489 1.8960 1.5598 1.5303 1.5916 2.6251 1.4151 2.3603 2.5154 1.5213 1.0882 1.0894 1.1933 1.1031 1.4471 1.1015 1.0808 1.1875 1.1003 4.5885 11.4250 1.0665 1.0667 1.0685 1.0685 1.0399 1.0657 1.0654 1.0615 1.0619 1.0961 1.0960 1.0954 1.0954 1.1006 1.1005 1.0921 1.1053 1.1053 1.1018
irintensity: 0.0276 1.7319 0.0003 0.0076 0.3230 0.8804 8.1805 0.1641 0.1221 0.4111 0.0365 0.0159 0.0432 6.2378 1.0629 0.0146 10.3466 5.3828 9.4721 1.5344 6.4524 3.0299 3.1640 0.0577 0.0014 0.0147 14.8230 0.0839 1.1361 14.8970 5.3754 1.6728 3.6692 7.1470 21.0639 3.8351 0.9643 0.3260 8.9625 10.3108 1.5926 1.2976 9.2432 0.0166 0.0624 0.1698 1.5067 14.2714 6.1574 1.9392 6.4549 0.8458 16.7588 0.0019 38.8952 4.7364 6.2216 0.7939 0.1036 6.0337 2.0760 0.0345 0.2305 0.5103 72.5964 15.3603 8.6588 0.2981 20.7935 26.8092 300.8407 185.3451 2.7658 15.2562 210.4265 1.7163 8.3021 15.7109 12.1562 264.2835 0.1867 1485.9578 169.0559 7.7573 103.5808 33.9343 11.4093 12.9190 33.4807 37.4733 26.7462 37.3110 16.3969 29.8110 17.0346 20.0330 49.3251 19.9774 16.4751 6.8971 126.1560 13.0089
temp: 298.150 k
press: 1.00000 atm
elementType: 7 7 7 7 7 6 6 6 6 6 6 6 6 6 6 6 6 1 1 1 1 1 1 1 1 1 1 1 1 1 1 1 1 1 1 1
symmnumber: 1
zpe: 802839.3 jmol-1
zpe.correction: 0.305785 hartree
zpe.thermalcorrener: 0.321192 hartree
zpe.thermalcorrenthalpy: 0.322136 hartree
zpe.thermalcorrgfe: 0.262096 hartree
zpe.sumelectzpe: -741.165380 hartree
zpe.sumelectthermal: -741.149974 hartree
zpe.sumelectthermalent: -741.149030 hartree
zpe.sumelectthermalfe: -741.209070 hartree
dipole: 0.0005 -2.7638 0.1464
dipole: 2.7677
quadrupole: -82.7440 -99.0578 -100.8934
quadrupole: 0.0093 0.0014 0.4914
quadrupole: 11.4878 -4.8261 -6.6617 0.0093 0.0014 0.4914
hfenergy: -741.4711658 hartree
pointgroup: C01 [X(C12H19N5)]
dipole: 0.0080337 -1.0871034 0.0619156 debye
polarizability: 231.1673921|0.4294053|178.2011601|0.0016809|-0.2197275|103.4856506 unknown
InChI: InChI=1S/C12H19N5/c1-10-13-11(16-6-2-3-7-16)15-12(14-10)17-8-4-5-9-17/h2-9H2,1H3
charge 0 multiplicity 1
36 atoms
N  2.348765 -0.359077 -0.000593
N  -2.33967 -0.392754 -0.000657
N  0.005059 -0.449761 0.011671
N  -1.225799 1.673842 -0.059535
N  1.205264 1.691264 -0.059671
C  4.650205 -0.818691 0.341444
C  3.966157 -2.077408 -0.255687
C  -4.633994 -0.885319 0.342518
C  -3.932523 -2.133998 -0.255408
C  3.664984 0.325254 0.000605
C  2.461339 -1.836702 0.0170
C  -3.665626 0.272523 0.000535
C  -2.431136 -1.871906 0.016554
C  1.154999 0.304535 -0.016207
C  -1.155535 0.287843 -0.016216
C  -0.014784 2.306374 -0.071083
C  -0.025228 3.81517 -0.076779
H  4.74357 -0.92243 1.438509
H  5.656553 -0.63731 -0.072075
H  4.14951 -2.126708 -1.345154
H  4.324938 -3.018397 0.194316
H  -5.643327 -0.718371 -0.0698
H  -4.724494 -0.99039 1.439702
H  -4.277559 -3.080135 0.194538
H  -4.115779 -2.185561 -1.344787
H  3.669212 1.151062 0.730944
H  3.870764 0.765832 -0.995067
H  1.795849 -2.283776 -0.741164
H  2.149155 -2.234862 1.003138
H  -3.878232 0.709201 -0.995435
H  -3.681449 1.098761 0.730212
H  -2.112785 -2.265815 1.002433
H  -1.759656 -2.309216 -0.742045
H  -0.940852 4.188948 -0.561383
H  -0.011829 4.195271 0.96245
H  0.870836 4.201604 -0.587628
