program: Gaussian 09
title: 000213579
version: EM64L-G09RevD.01
frameworkgroup: C1[X(C14H19NO3)]
method: RPBEPBE
basis: SDD
operation: Freq
keyword: #p
keyword: freq=noraman
keyword: PBEPBE/SDD
title: #p freq=noraman PBEPBE/SDD
converged: YES YES NO NO
title: Mulliken charges:
elementType: O O O N C C C C C C C C C C C C C C H H H H H H H H H H H H H H H H H H H
charge: -0.292147 -0.432397 -0.381961 -0.384761 0.225386 0.570356 -0.366085 -0.535939 -0.007491 -0.348040 -0.622066 -0.633735 0.251535 0.229309 -0.687221 -0.032014 -0.518270 -0.595063 0.260272 0.208980 0.205738 0.206194 0.232773 0.259674 0.220251 0.225688 0.319330 0.206143 0.229169 0.214018 0.232265 0.391349 0.208368 0.225516 0.277581 0.215815 0.221481
chargesum: 0.00000
title: Mulliken charges with hydrogens summed into heavy atoms:
elementType: O O O N C C C C C C C C C C C C C C
charge: -0.292147 -0.041049 -0.381961 -0.065431 0.225386 0.570356 0.103167 -0.330201 -0.007491 0.090927 -0.362392 -0.187796 0.251535 0.229309 -0.037891 0.200251 0.193195 -0.157768
polarizability: 2.23781104e+02 -1.84239015e+01 2.09819470e+02 1.14111503e+01 -6.88736694e+00 1.06456496e+02
1716.lowfreq: -2.9466 -0.0002 0.0007 0.0010 3.4640 6.5575 23.3616 34.8135 40.8187
frequency: 22.7346 34.7993 40.7567 54.9828 61.3443 65.9010 94.8414 110.8592 120.5149 146.1958 159.7319 177.3352 229.7751 234.4449 238.8283 257.9350 295.6336 335.4212 357.9370 370.1569 388.0046 421.3987 436.1992 454.8258 470.2432 504.8928 531.8648 549.4216 592.8784 638.0615 667.0939 700.2714 730.7484 756.6613 764.4317 785.2792 846.7065 855.7513 865.7105 890.8093 900.3469 920.4788 935.5384 945.1243 950.0148 976.8109 997.2484 1015.4191 1030.6937 1089.3903 1100.2356 1113.8986 1113.9605 1130.7460 1138.0630 1159.7455 1193.7856 1217.2287 1233.4696 1246.7519 1269.9030 1280.4083 1284.7204 1292.8702 1318.1009 1341.5971 1355.6864 1360.4677 1391.5945 1402.6014 1412.4688 1424.5263 1437.6120 1452.8660 1454.4263 1457.0836 1462.3867 1465.3998 1480.7326 1481.3704 1487.7672 1517.8176 1561.2500 1609.3752 1640.0673 1653.7331 2594.5852 2967.5686 2973.3626 2979.4289 2990.8344 2999.7483 3017.3307 3044.2429 3072.3513 3076.6819 3080.8246 3086.1925 3092.4462 3094.1808 3115.8495 3136.5009 3145.6338 3194.0503 3578.7302
redmass: 3.3702 3.3769 4.4476 3.8033 1.8634 3.1971 2.1838 2.2781 2.8448 2.5549 2.6130 3.3053 2.2355 1.8851 2.6965 3.5807 3.8251 3.5078 2.9243 2.8439 4.6889 4.2561 5.4108 3.8480 2.5294 2.9500 2.6312 1.6525 2.3777 4.0666 2.5154 5.8880 3.6957 1.7586 3.0516 3.8335 1.7286 2.5023 2.4494 1.9566 1.9066 1.5209 2.1511 2.3564 1.4629 1.0583 2.3047 1.1595 3.5474 2.9255 2.2135 1.2758 1.6595 1.8191 2.0678 1.4841 1.7061 1.4313 2.3179 1.2775 1.6058 1.4204 1.7997 1.3507 2.5240 1.4347 2.2781 1.3701 1.3018 2.9388 2.1068 1.2043 1.4091 1.2190 1.1097 1.1526 2.1419 1.0751 1.0553 1.0530 1.0555 2.1462 6.2671 3.7590 3.2350 4.6549 1.0737 1.0593 1.0363 1.0356 1.0619 1.0651 1.0999 1.0982 1.1003 1.0985 1.0648 1.1006 1.0956 1.0886 1.0899 1.1057 1.0917 1.1144 1.0771
irintensity: 0.0431 0.8377 2.2715 2.4841 6.8085 0.0626 0.0697 0.9759 1.1301 3.5150 3.1303 1.2988 1.1955 1.6951 2.4060 3.5654 1.3861 5.5935 0.5990 2.7237 2.5002 23.3908 18.9596 17.4027 6.6783 0.0828 5.5533 49.9812 37.9880 2.6615 20.6122 1.4164 3.6915 26.3857 21.8633 7.6073 16.4614 14.5227 6.3640 5.5111 17.0692 18.6665 18.0179 4.3006 68.3786 132.3019 13.3687 22.2472 72.7407 2.3755 11.4742 10.2668 6.1441 5.0730 2.5611 5.2120 26.9302 14.3559 5.8698 17.0275 63.5055 58.7417 64.3382 71.6969 274.0688 1.9883 186.4761 10.4821 20.2072 12.2966 1.7940 5.0702 104.3616 66.3987 2.1018 51.8858 220.0204 4.4581 15.2394 28.1387 12.3089 307.3407 59.7758 34.6757 31.9959 17.0477 636.7302 30.7343 28.2326 93.0011 30.5976 40.6978 11.8235 2.9100 77.3981 47.2755 17.8802 12.0023 42.0737 7.1993 10.0892 10.3290 4.6615 26.5146 17.9024
temp: 298.150 k
press: 1.00000 atm
elementType: 8 8 8 7 6 6 6 6 6 6 6 6 6 6 6 6 6 6 1 1 1 1 1 1 1 1 1 1 1 1 1 1 1 1 1 1 1
symmnumber: 1
zpe: 796759.0 jmol-1
zpe.correction: 0.303469 hartree
zpe.thermalcorrener: 0.322832 hartree
zpe.thermalcorrenthalpy: 0.323777 hartree
zpe.thermalcorrgfe: 0.253620 hartree
zpe.sumelectzpe: -823.939054 hartree
zpe.sumelectthermal: -823.919691 hartree
zpe.sumelectthermalent: -823.918747 hartree
zpe.sumelectthermalfe: -823.988903 hartree
dipole: -3.1424 3.0457 1.0905
dipole: 4.5100
quadrupole: -97.8078 -109.9138 -107.4304
quadrupole: -2.4916 5.2002 -5.4095
quadrupole: 7.2428 -4.8631 -2.3797 -2.4916 5.2002 -5.4095
hfenergy: -824.2425234 hartree
pointgroup: C01 [X(C14H19N1O3)]
dipole: 1.099613 -1.2883507 0.5285923 debye
polarizability: 220.8794881|-19.9498688|213.8106626|-5.2438028|2.591711|105.3669198 unknown
InChI: InChI=1S/C14H19NO3/c1-4-6-10-8-11(14(17)15-7-5-2)13(16)12(9-10)18-3/h4,8-9,15-16H,1,5-7H2,2-3H3
charge 0 multiplicity 1
37 atoms
O  -3.56334 1.699735 -0.397168
O  -0.84981 2.684288 -0.687089
O  1.574968 2.165423 -0.898581
N  2.415141 0.014475 -0.813594
C  -0.030299 0.363916 -0.649562
C  -1.66065 -1.48091 -0.487613
C  3.811803 0.472713 -0.943143
C  -0.335097 -1.024918 -0.607888
C  -1.093331 1.330037 -0.582717
C  4.533796 0.634035 0.416808
C  -2.697377 -0.518105 -0.3850
C  -1.98778 -2.976151 -0.496685
C  -2.439448 0.865343 -0.424927
C  1.356169 0.885957 -0.792158
C  4.665998 -0.683285 1.210367
C  -1.007043 -3.82468 0.290864
C  -3.508782 2.960941 0.375536
C  -0.294092 -4.863479 -0.213994
H  3.78507 1.442961 -1.466834
H  4.354489 -0.254738 -1.577153
H  0.456032 -1.781194 -0.681568
H  5.540233 1.05072 0.21394
H  3.991331 1.38871 1.016284
H  -3.742691 -0.828613 -0.277346
H  -3.004927 -3.116292 -0.078497
H  -2.027444 -3.346076 -1.541119
H  2.240105 -0.981713 -0.687729
H  5.207668 -1.451787 0.625848
H  5.223861 -0.523746 2.150415
H  3.674919 -1.092514 1.482196
H  -0.89023 -3.553948 1.351709
H  0.187656 2.780351 -0.811006
H  -3.298134 2.74766 1.441351
H  -4.517137 3.389831 0.271809
H  -2.741815 3.638214 -0.028426
H  0.385363 -5.453362 0.411648
H  -0.381581 -5.161401 -1.266781
