program: Gaussian 09
title: 000213578
version: EM64L-G09RevD.01
frameworkgroup: C1[X(C17H17NO3)]
method: RPBEPBE
basis: SDD
operation: Freq
keyword: #p
keyword: freq=noraman
keyword: PBEPBE/SDD
title: #p freq=noraman PBEPBE/SDD
converged: YES YES NO NO
title: Mulliken charges:
elementType: O O O N C C C C C C C C C C C C C C C C C H H H H H H H H H H H H H H H H H
charge: -0.290781 -0.428881 -0.385539 -0.468600 0.568747 0.208144 -0.522695 -0.636053 -0.005579 -0.621648 0.249524 0.206545 0.476757 -0.033718 -0.335563 -0.451548 -0.212158 -0.197699 -0.252268 -0.517260 -0.594395 0.200167 0.221440 0.227216 0.261742 0.323676 0.233807 0.316165 0.220487 0.398742 0.228790 0.228443 0.231192 0.276622 0.209728 0.227131 0.216937 0.222386
chargesum: 0.00000
title: Mulliken charges with hydrogens summed into heavy atoms:
elementType: O O O N C C C C C C C C C C C C C C C C C
charge: -0.290781 -0.030139 -0.385539 -0.144924 0.568747 0.208144 -0.322528 -0.187398 -0.005579 -0.359907 0.249524 0.206545 0.476757 0.200089 -0.019398 -0.231061 0.016632 0.030744 -0.021075 0.196221 -0.155072
polarizability: 3.27061070e+02 -2.10185304e+01 2.47750557e+02 -1.28250559e+00 -4.48792797e+00 9.70611108e+01
1716.lowfreq: -0.0007 -0.0003 -0.0003 1.8018 6.7327 8.0905 18.7337 37.6860 39.5497
frequency: 18.5114 37.6506 39.4924 52.2589 56.5327 79.5906 86.0485 109.3487 128.9748 145.1582 171.1865 204.0550 208.7181 241.3174 246.3769 284.1925 314.5624 339.7136 373.6995 390.1884 406.9958 432.6345 440.9437 459.7571 494.7899 509.5679 525.9985 556.7861 581.9808 614.4625 639.9568 645.4037 673.9433 695.4757 699.6366 753.7927 762.5051 771.2429 784.8180 839.0642 843.2783 847.0405 884.8674 894.6228 919.8859 920.5188 936.2503 952.3639 956.6339 961.3784 975.5432 985.4570 1002.9446 1015.9638 1025.1209 1031.1785 1088.8629 1113.6356 1114.8414 1120.8490 1159.3416 1172.4302 1177.8174 1188.2521 1217.7519 1232.0355 1248.1134 1267.8119 1281.2292 1291.9910 1305.1560 1330.2849 1354.0230 1388.2823 1404.2621 1415.3936 1425.9283 1435.6116 1441.0945 1454.0221 1456.4334 1459.6842 1481.1416 1485.5641 1535.0528 1557.9386 1602.6057 1608.8135 1614.8881 1639.5329 1654.0809 2660.7003 2968.9067 2980.8299 3019.1271 3081.9637 3094.6720 3095.1676 3107.8743 3112.0003 3134.1944 3138.7508 3146.6668 3147.0231 3167.1546 3195.0525 3204.4292 3541.7807
redmass: 4.1148 4.8582 3.1633 3.6568 1.9543 4.7791 3.8045 2.5360 3.3892 2.4354 3.9484 3.7924 4.2849 4.7336 3.7688 4.2625 4.2537 4.7886 2.9882 4.0963 2.9256 10.4087 6.3096 3.9312 3.6996 2.8404 3.2792 5.0383 2.7437 6.3566 3.4924 1.5277 2.3283 2.0518 5.1120 7.2379 3.0964 1.9197 4.3203 1.8855 2.1334 1.9072 5.2546 1.5053 1.4272 1.5426 2.3164 1.4230 4.5776 1.0712 1.3466 6.1742 1.3066 1.1618 2.5889 3.2358 1.5622 1.2504 1.7435 2.2481 1.4924 1.1168 1.7226 1.1316 1.4049 1.9872 2.6524 1.9461 1.4883 1.6244 2.3873 1.7139 2.1334 8.3580 4.4410 2.1701 1.2095 1.7042 1.9107 1.2783 1.2099 1.7960 1.0534 2.4611 2.2271 5.6230 4.4865 3.5612 6.1733 3.3049 4.6463 1.0724 1.0594 1.0359 1.1001 1.0646 1.0954 1.0890 1.0892 1.0895 1.0867 1.1056 1.0933 1.0918 1.1000 1.1143 1.0946 1.0753
irintensity: 0.4699 0.6826 0.1638 1.2006 5.6713 1.4668 0.2160 1.0840 0.2719 3.6940 0.1906 7.6667 2.2577 3.2151 2.2071 0.4895 1.4471 10.2531 0.7452 2.5819 0.0250 13.2795 17.6433 3.7911 13.1313 8.2980 1.0778 28.3932 12.3955 0.3664 10.0358 21.9862 15.6616 39.7428 5.3490 13.7826 0.2399 113.6080 6.6783 8.6796 1.3509 18.3436 14.4966 13.7977 2.3753 20.6617 14.3011 74.7007 0.4695 137.0077 4.1483 0.0901 7.5301 24.2717 16.6358 77.8374 14.8243 14.1742 5.4537 5.1017 4.9642 4.0945 24.2313 2.1723 9.1576 11.3994 9.5886 123.1017 87.2261 125.1136 34.1920 265.9934 252.5442 38.4241 96.0916 11.0838 3.1755 162.5539 26.0871 61.8529 62.9984 170.1609 33.8189 86.7984 450.7727 16.6644 19.0947 78.6110 31.9035 28.9208 15.7739 661.6620 30.6569 94.1449 11.1557 16.7971 41.9717 7.4183 15.4504 10.0893 0.3093 10.7007 26.3883 4.6758 28.4945 25.4287 8.4328 14.5783
temp: 298.150 k
press: 1.00000 atm
elementType: 8 8 8 7 6 6 6 6 6 6 6 6 6 6 6 6 6 6 6 6 6 1 1 1 1 1 1 1 1 1 1 1 1 1 1 1 1 1
symmnumber: 1
zpe: 786493.4 jmol-1
zpe.correction: 0.299560 hartree
zpe.thermalcorrener: 0.319246 hartree
zpe.thermalcorrenthalpy: 0.320190 hartree
zpe.thermalcorrgfe: 0.249056 hartree
zpe.sumelectzpe: -936.914967 hartree
zpe.sumelectthermal: -936.895280 hartree
zpe.sumelectthermalent: -936.894336 hartree
zpe.sumelectthermalfe: -936.965470 hartree
dipole: -1.3980 3.3075 1.2342
dipole: 3.7970
quadrupole: -112.9271 -116.1368 -127.1029
quadrupole: -2.3320 4.2302 -3.8432
quadrupole: 5.7952 2.5855 -8.3807 -2.3320 4.2302 -3.8432
hfenergy: -937.2145263 hartree
pointgroup: C01 [X(C17H17N1O3)]
dipole: 0.2871184 -1.3145817 0.6489168 debye
polarizability: 315.7467481|-34.6055339|257.7459025|3.33217|-15.3684425|98.3800881 unknown
InChI: InChI=1S/C17H17NO3/c1-3-7-12-10-14(16(19)15(11-12)21-2)17(20)18-13-8-5-4-6-9-13/h3-6,8-11,18-19H,1,7H2,2H3
charge 0 multiplicity 1
38 atoms
O  -3.89917 2.681069 -0.304298
O  -1.021995 2.970854 -0.361449
O  1.215925 1.88334 -0.246201
N  1.480552 -0.401059 0.156567
C  -2.828264 -0.845285 0.088402
C  -0.787537 0.539969 -0.033233
C  -1.427156 -0.726699 0.087031
C  -3.505128 -2.215972 0.166928
C  -1.58896 1.727257 -0.172932
C  -3.605658 0.337201 -0.010235
C  -3.016337 1.609335 -0.134181
C  0.69025 0.711933 -0.050748
C  2.902405 -0.509162 0.177224
C  -2.835468 -3.176347 1.131948
C  3.778189 0.590705 -0.02704
C  3.440016 -1.803467 0.418403
C  5.172918 0.376236 0.012528
C  4.834437 -1.999112 0.455403
C  5.711957 -0.908218 0.252051
C  -3.617518 3.968593 0.37004
C  -2.343076 -4.396985 0.800458
H  -0.848699 -1.655579 0.168106
H  -4.560217 -2.070237 0.473986
H  -3.534893 -2.678029 -0.840337
H  -4.700283 0.291819 0.001059
H  0.984901 -1.277704 0.328385
H  -2.761825 -2.82845 2.173938
H  3.359846 1.581088 -0.209113
H  2.765482 -2.655639 0.57616
H  0.011174 2.818826 -0.373334
H  5.843419 1.228181 -0.146115
H  5.234402 -3.001661 0.641987
H  6.796222 -1.058686 0.280065
H  -2.679836 4.410252 0.001845
H  -3.559874 3.821629 1.465773
H  -4.482797 4.601974 0.12235
H  -1.887709 -5.056103 1.548232
H  -2.395999 -4.777468 -0.22775
