program: Gaussian 09
title: 000213562
version: EM64L-G09RevD.01
frameworkgroup: C1[X(C13H24N6)]
method: RPBEPBE
basis: SDD
operation: Freq
keyword: #pfreq=noraman
keyword: PBEPBE/SDD
title: #p freq=noraman PBEPBE/SDD
converged: YES YES NO NO
title: Mulliken charges:
elementType: N N N N N N C C C C C C C C C C C C C H H H H H H H H H H H H H H H H H H H H H H H H
charge: -0.376839 -0.152012 -0.125359 -0.156748 -0.156180 -0.594392 -0.030600 -0.460052 -0.425990 -0.412596 -0.396950 -0.375738 0.062015 0.162143 -0.349014 -0.352062 0.006696 -0.668656 -0.667702 0.242085 0.216157 0.198799 0.187043 0.235119 0.187407 0.205355 0.198032 0.207282 0.190492 0.200105 0.316299 0.201819 0.253248 0.202816 0.251834 0.206799 0.248408 0.209133 0.207951 0.245391 0.209208 0.323461 0.325794
chargesum: 0.00000
title: Mulliken charges with hydrogens summed into heavy atoms:
elementType: N N N N N N C C C C C C C C C C C C C
charge: -0.060541 -0.152012 -0.125359 -0.156748 -0.156180 0.054863 0.211485 -0.045095 -0.003828 -0.019834 0.008364 0.014858 0.062015 0.162143 0.106054 0.102588 0.006696 -0.004316 -0.005152
polarizability: 2.39952436e+02 5.91742023e-01 2.02670214e+02 -8.40320728e+00 -9.10302447e-02 1.31766337e+02
1716.lowfreq: -9.6447 -2.7449 -0.0001 0.0003 0.0004 7.3811 18.6624 37.1256 43.5970
frequency: 17.7207 37.0450 43.5904 57.9555 60.5961 72.3095 94.0805 124.9504 164.8180 173.3135 198.1636 202.7274 212.3488 215.5440 247.4195 255.5870 298.7007 318.6752 356.9362 367.8084 379.3075 419.3210 433.0210 454.6652 479.1243 493.7492 529.8948 535.3081 538.6283 545.6600 586.2562 628.7073 689.8632 704.8060 706.1358 771.9491 772.9509 774.8746 788.7783 797.9859 832.3574 846.9972 862.2948 870.9206 895.9400 925.1124 929.1718 972.3688 977.4912 1009.6511 1016.7291 1041.0583 1052.5035 1061.2624 1075.7550 1080.7069 1087.3443 1097.7249 1112.4695 1117.8919 1149.6760 1168.2812 1208.9471 1220.1984 1243.6881 1249.3083 1257.1867 1271.5760 1292.3386 1305.1228 1309.4259 1319.8989 1329.5646 1335.6430 1345.3823 1349.8081 1351.0540 1360.5161 1365.5369 1379.0601 1381.4230 1384.3172 1416.8828 1449.3364 1452.4346 1455.8033 1460.5239 1465.2708 1466.9112 1467.1602 1471.0670 1477.6166 1482.0129 1483.5083 1493.2782 1512.3361 1519.8758 1562.3060 1617.5692 2954.7776 2963.7828 2969.7857 2973.7576 2979.9395 2980.1306 2980.7069 2996.3701 3002.8037 3019.2804 3025.5424 3027.5636 3036.8686 3042.3541 3051.3259 3065.8498 3066.5113 3082.2636 3082.8600 3097.6823 3099.4590 3560.7914 3566.0303 3722.7009
redmass: 3.4523 3.3383 2.9356 3.4480 2.8029 3.3444 3.7058 3.8467 3.8591 3.0739 5.0598 2.1393 1.0779 2.5572 2.2906 1.8253 2.7423 2.3150 2.1320 2.4801 2.3851 2.9535 1.2151 2.8038 2.6171 2.7661 1.0866 2.1805 3.3526 1.3783 4.7043 2.8302 4.2032 10.1519 9.6987 1.3315 1.2173 1.4807 8.9271 3.3556 1.7253 2.5165 2.3048 2.0420 10.9186 1.7261 1.7084 2.4235 2.6898 2.8184 2.4039 1.7117 1.6277 2.3690 1.9755 1.8674 1.6838 1.7636 1.0532 1.9746 1.8840 2.2510 2.4539 2.9331 1.4521 2.6045 1.3036 1.3621 1.8745 1.5169 1.4141 1.4722 1.3210 1.4344 1.4940 1.2335 1.4515 1.4946 1.3216 1.2290 1.2601 1.6177 3.8433 1.2688 1.1026 1.0869 1.0897 1.0471 1.0845 1.0527 1.0875 1.1337 1.0529 1.0573 3.1899 2.6569 5.2665 2.2603 2.3419 1.0668 1.0620 1.0656 1.0617 1.0360 1.0609 1.0362 1.0645 1.0645 1.0857 1.0944 1.0966 1.1011 1.1015 1.0993 1.0991 1.0990 1.0972 1.0975 1.1020 1.1021 1.0442 1.0759 1.1058
irintensity: 0.0189 0.4495 0.0326 0.2000 0.0239 1.1147 4.8693 2.1148 1.2278 2.2826 0.1693 1.5539 0.4713 0.7352 0.6319 1.4374 0.2102 0.7203 2.1638 2.8364 5.6938 5.7446 272.4566 5.1958 1.8728 2.2431 4.8277 38.7811 3.5343 64.9271 5.4848 3.5907 4.0954 0.1327 0.3370 22.1658 7.1014 1.9353 30.2809 3.7590 7.0035 7.4647 8.1314 7.7518 0.8192 4.0785 9.8259 6.6371 0.1467 10.2060 17.5081 4.7688 0.5203 11.9565 10.0551 34.9410 1.5122 13.8552 1.0583 6.6171 6.6818 6.1921 1.4144 17.1159 4.8886 8.6007 7.2880 27.3391 9.5221 65.3757 30.5401 25.2873 1.5015 1.0359 8.8277 2.2590 6.0422 18.2488 36.3937 14.7271 30.5486 22.5030 8.5936 124.2760 31.0834 11.5430 6.6776 6.1121 8.2758 3.9111 11.4209 64.5904 6.8879 21.6889 293.8660 616.3168 1317.8018 584.8885 121.0150 28.1660 40.8807 23.3434 29.6434 39.3349 12.3345 39.2931 34.1553 73.2352 43.8803 85.1885 53.9395 24.8640 66.0893 65.8465 24.2694 1.1793 52.1313 25.6723 11.6881 52.5781 89.7142 52.4340 40.1143
temp: 298.150 k
press: 1.00000 atm
elementType: 7 7 7 7 7 7 6 6 6 6 6 6 6 6 6 6 6 6 6 1 1 1 1 1 1 1 1 1 1 1 1 1 1 1 1 1 1 1 1 1 1 1 1
symmnumber: 1
zpe: 978533.4 jmol-1
zpe.correction: 0.372704 hartree
zpe.thermalcorrener: 0.392551 hartree
zpe.thermalcorrenthalpy: 0.393496 hartree
zpe.thermalcorrgfe: 0.323027 hartree
zpe.sumelectzpe: -836.855573 hartree
zpe.sumelectthermal: -836.835725 hartree
zpe.sumelectthermalent: -836.834781 hartree
zpe.sumelectthermalfe: -836.905249 hartree
dipole: 0.1836 -0.5465 0.0716
dipole: 0.5810
quadrupole: -101.2969 -102.9418 -118.5095
quadrupole: -1.0672 -1.5413 0.0277
quadrupole: 6.2858 4.6410 -10.9268 -1.0672 -1.5413 0.0277
hfenergy: -837.2282766 hartree
pointgroup: C01 [X(C13H24N6)]
dipole: 0.0789087 -0.2131733 0.023936 debye
polarizability: 239.8701926|1.9178249|202.7296058|-8.4191112|1.0458994|131.7891881 unknown
InChI: InChI=1S/C13H24N6/c1-3-19(4-2)13-17-11(14)16-12(18-13)15-10-8-6-5-7-9-10/h10,15H,3-9,14H2,1-2H3
charge 0 multiplicity 1
43 atoms
N  1.682763 0.733265 -0.457757
N  -0.45712 -0.22594 -0.231207
N  -2.648844 -1.061992 -0.000411
N  -0.1208 2.198289 -0.264982
N  -2.373936 1.277708 -0.018629
N  -1.994316 3.585801 -0.069968
C  2.368676 -0.573026 -0.527277
C  3.728896 -0.404298 -1.249446
C  2.570728 -1.197044 0.88306
C  4.7624 0.380206 -0.401174
C  3.590068 -0.402202 1.730778
C  4.945442 -0.262224 0.995363
C  0.327977 0.894188 -0.309247
C  -1.805638 0.024244 -0.087535
C  -4.110457 -0.873267 0.11845
C  -2.114824 -2.439975 -0.030879
C  -1.477987 2.311437 -0.121379
C  -4.584171 -0.777905 1.585063
C  -2.038804 -3.019955 -1.460159
H  1.713261 -1.24522 -1.111922
H  3.573026 0.084456 -2.230777
H  4.132074 -1.416317 -1.452088
H  2.932489 -2.238179 0.750333
H  1.589846 -1.253831 1.388891
H  4.439198 1.435791 -0.2768
H  5.729903 0.418351 -0.937836
H  3.735974 -0.898347 2.7097
H  3.180387 0.606222 1.944314
H  5.398761 -1.268337 0.873748
H  5.65279 0.336741 1.601318
H  2.220192 1.59944 -0.510085
H  -4.601467 -1.72397 -0.391884
H  -4.379439 0.053168 -0.414584
H  -2.767532 -3.067409 0.606081
H  -1.106699 -2.425117 0.414445
H  -4.299848 -1.677485 2.161755
H  -4.132498 0.105584 2.067605
H  -5.684764 -0.675922 1.629519
H  -3.029215 -3.012052 -1.951464
H  -1.340878 -2.422367 -2.071173
H  -1.676355 -4.064723 -1.43509
H  -2.996832 3.708696 0.039532
H  -1.360932 4.377517 -0.135603
