program: Gaussian 09
title: 000213552
version: EM64L-G09RevD.01
frameworkgroup: C1[X(C13H16N2O3)]
method: RPBEPBE
basis: SDD
operation: Freq
keyword: #p
keyword: freq=noraman
keyword: PBEPBE/SDD
title: #p freq=noraman PBEPBE/SDD
converged: YES YES NO NO
title: Mulliken charges:
elementType: O O O N N C C C C C C C C C C C C C H H H H H H H H H H H H H H H H
charge: -0.267015 -0.261328 -0.223939 -0.116211 -0.405404 -0.318238 0.269495 -0.352867 -0.394339 0.101265 0.216894 0.375188 -0.658884 -0.646721 -0.347322 -0.377277 -0.226056 -0.219220 0.268173 0.261375 0.207303 0.274315 0.222689 0.329517 0.204862 0.254593 0.218490 0.219588 0.227961 0.221971 0.247732 0.231551 0.231807 0.230051
chargesum: 0.00000
title: Mulliken charges with hydrogens summed into heavy atoms:
elementType: O O O N N C C C C C C C C C C C C C
charge: -0.267015 -0.261328 -0.223939 -0.116211 -0.075887 -0.050065 0.269495 0.115811 0.102665 0.101265 0.216894 0.375188 0.019061 0.022800 -0.099590 -0.145726 0.005751 0.010832
polarizability: 1.93691326e+02 2.34277043e+01 1.69742978e+02 1.97427452e+01 -1.48258806e+01 1.24080968e+02
1716.lowfreq: -8.4157 -2.6684 -0.0002 0.0005 0.0006 11.7722 26.1831 36.2123 58.5556
frequency: 25.5187 36.1863 58.5493 71.9301 80.5225 90.5535 126.5655 136.7136 185.5110 201.3214 211.9884 240.5760 260.0311 304.3877 311.5838 325.3928 352.1872 419.0263 429.2899 445.7866 476.5922 491.9980 503.8669 538.4949 551.1566 584.7019 614.4073 658.6154 676.8104 711.6865 723.5939 754.4929 757.5699 775.2171 786.9005 820.9326 849.2838 874.1462 893.3723 927.9330 942.1688 943.2750 958.1197 968.7247 1020.8351 1029.3098 1072.9274 1079.8795 1098.0775 1103.5055 1139.4335 1167.9344 1177.7920 1208.6527 1237.5280 1244.6467 1268.7975 1279.3424 1296.4721 1305.5522 1342.9165 1345.3653 1358.5447 1372.0435 1386.6932 1391.5356 1414.4364 1415.6121 1456.8174 1467.3707 1468.9049 1469.5137 1480.5578 1482.8043 1493.3236 1507.0139 1589.1561 1604.8079 1619.7715 1649.7772 2985.5341 2985.7220 3004.4374 3011.0600 3069.8096 3070.6473 3085.0078 3086.6748 3093.8856 3099.0503 3103.4029 3129.8525 3145.0167 3160.9823 3176.2710 3530.5168
redmass: 4.5812 3.7329 3.1745 4.3326 2.9830 5.8969 4.9919 3.4813 3.4978 1.4536 1.2821 1.9728 5.5612 5.0855 3.3753 4.3168 3.0604 3.5527 4.2635 3.9956 4.5165 5.0168 5.4433 4.6887 3.7479 4.8823 2.4861 6.6675 2.2282 3.9184 4.3161 1.3340 4.5163 1.3660 1.1746 2.7465 1.4573 4.5531 4.2049 1.3864 2.7711 2.3845 6.9199 1.3075 2.8332 2.0582 2.1419 1.8361 1.7694 1.9204 1.8935 1.0840 2.3557 2.8842 1.6962 1.6012 1.8200 1.4252 1.3623 1.3438 1.7799 1.7266 1.2889 3.0581 1.2190 1.2095 2.8571 2.9478 1.1084 1.0441 2.5647 1.0482 1.0503 1.0566 3.3777 1.1002 6.5407 6.6731 7.5099 6.6587 1.0356 1.0359 1.0662 1.0631 1.0989 1.0983 1.0995 1.0993 1.0984 1.0888 1.1023 1.0880 1.0886 1.0940 1.1003 1.0768
irintensity: 1.8936 1.0342 1.4364 3.7423 0.1845 0.9620 0.1589 0.3045 2.0145 0.3131 0.3484 4.5577 4.1480 3.7622 0.7557 6.4916 9.5279 0.7636 3.0950 8.8459 20.6174 11.2904 14.0268 8.7192 2.4011 2.1739 20.1360 19.5489 45.0142 12.8686 1.0483 121.2384 28.5434 4.6469 4.5654 15.7402 0.5933 3.5404 17.8792 4.7169 28.2909 4.8305 28.7284 0.0258 7.9396 14.6541 8.6725 8.9755 22.8229 48.4651 26.0793 2.7803 52.3387 26.4941 2.0269 35.1674 7.0752 33.8866 30.3842 8.4504 80.0389 56.0135 6.4476 32.9635 14.1762 25.7373 43.7401 9.2260 21.0523 4.1377 5.0986 13.6970 6.8300 10.3143 141.7721 11.3613 267.4445 21.5894 53.8156 446.6785 20.3250 23.3702 24.0785 38.8454 9.2709 1.7021 34.6240 41.6499 25.3311 12.7009 29.9688 5.8690 6.8560 18.1594 13.9364 34.7114
temp: 298.150 k
press: 1.00000 atm
elementType: 8 8 8 7 7 6 6 6 6 6 6 6 6 6 6 6 6 6 1 1 1 1 1 1 1 1 1 1 1 1 1 1 1 1
symmnumber: 1
zpe: 717060.8 jmol-1
zpe.correction: 0.273114 hartree
zpe.thermalcorrener: 0.290386 hartree
zpe.thermalcorrenthalpy: 0.291330 hartree
zpe.thermalcorrgfe: 0.227005 hartree
zpe.sumelectzpe: -838.835392 hartree
zpe.sumelectthermal: -838.818120 hartree
zpe.sumelectthermalent: -838.817176 hartree
zpe.sumelectthermalfe: -838.881501 hartree
dipole: 0.7132 -3.5865 2.0417
dipole: 4.1881
quadrupole: -83.0394 -112.5094 -110.0827
quadrupole: -5.2464 8.3075 0.2455
quadrupole: 18.8378 -10.6322 -8.2056 -5.2464 8.3075 0.2455
hfenergy: -839.108506 hartree
pointgroup: C01 [X(C13H16N2O3)]
dipole: 0.2065516 1.6332183 -0.0705954 debye
polarizability: 181.7742023|-8.2655576|170.9194135|-40.0087572|11.6565289|134.8216558 unknown
InChI: InChI=1S/C13H16N2O3/c1-3-15(4-2)13(17)11-12(16)14-9-7-5-6-8-10(9)18-11/h5-8,11,14H,3-4H2,1-2H3
charge 0 multiplicity 1
34 atoms
O  -0.525257 0.483525 -1.437659
O  1.134276 -1.095757 1.022646
O  -0.08413 -3.135871 -1.421083
N  2.392315 0.334382 -0.323645
N  -1.670111 -1.817436 -0.330758
C  0.331115 -0.727048 -1.26698
C  1.328561 -0.515717 -0.093124
C  3.341385 0.576395 0.793467
C  2.632544 1.057502 -1.596965
C  -0.484871 -2.00858 -1.023331
C  -1.558492 0.611084 -0.478194
C  -2.149995 -0.550623 0.084373
C  2.910754 1.764021 1.679673
C  3.61151 0.317761 -2.535131
C  -2.035015 1.89328 -0.157869
C  -3.223491 -0.410018 0.991344
C  -3.117849 2.026745 0.741848
C  -3.706863 0.876432 1.317283
H  0.844298 -0.840692 -2.233241
H  3.385175 -0.343697 1.400205
H  4.341085 0.75434 0.355505
H  1.669528 1.24535 -2.098619
H  3.043251 2.052102 -1.338779
H  -2.184463 -2.661432 -0.064832
H  2.828459 2.698264 1.094177
H  1.933129 1.55428 2.145534
H  3.650595 1.928108 2.484264
H  4.5869 0.149598 -2.044382
H  3.211935 -0.667624 -2.834548
H  3.786954 0.911891 -3.450619
H  -1.560107 2.765557 -0.617093
H  -3.677205 -1.302501 1.438302
H  -3.493232 3.023532 0.994294
H  -4.53979 0.978651 2.020239
