program: Gaussian 09
title: 000213551
version: EM64L-G09RevD.01
frameworkgroup: C1[X(C14H14N2O2S)]
method: RPBEPBE
basis: SDD
operation: Freq
keyword: #p
keyword: freq=noraman
keyword: PBEPBE/SDD
title: #p freq=noraman PBEPBE/SDD
converged: NO YES NO NO
title: Mulliken charges:
elementType: S O O N N C C C C C C C C C C C C C C H H H H H H H H H H H H H H
charge: 0.378497 -0.220045 -0.195637 -0.354922 0.006187 0.158419 -0.522233 -0.407648 -0.597745 0.409577 0.112170 0.198636 -0.725326 -0.393201 -0.398637 -0.237288 -0.249702 -0.239140 -0.360156 0.273242 0.265911 0.244134 0.219754 0.359088 0.358773 0.239679 0.219384 0.230851 0.271711 0.250359 0.232332 0.237066 0.235908
chargesum: 0.00000
title: Mulliken charges with hydrogens summed into heavy atoms:
elementType: S O O N N C C C C C C C C C C C C C C
charge: 0.378497 -0.220045 -0.195637 0.003851 0.006187 0.158419 0.016921 0.056240 -0.238657 0.409577 0.112170 0.198636 -0.035412 -0.121490 -0.148277 -0.004956 -0.012635 -0.003232 -0.360156
polarizability: 1.96988647e+02 5.33045632e+00 1.92021608e+02 8.59934469e+00 1.14418955e+01 1.43466453e+02
1716.lowfreq: -0.0016 -0.0010 0.0014 5.5879 10.1322 11.8445 26.2636 36.7295 58.4311
frequency: 26.1599 36.6292 58.4188 62.3238 83.8399 102.3855 108.4787 147.1121 158.0895 172.2803 196.5957 229.1372 257.5938 275.7666 300.1483 312.1616 347.3630 371.5123 382.3179 397.4367 404.1286 439.0734 446.1809 520.4053 539.4448 577.9268 598.9852 616.7192 627.9594 667.0295 688.5422 702.3537 708.4946 754.7787 764.9536 773.4628 808.9623 814.0694 859.9052 887.4348 926.1508 956.4204 985.9196 989.9742 992.5799 1003.7408 1005.9536 1035.1475 1065.6934 1090.2935 1099.5948 1108.8448 1138.8005 1170.5315 1178.8836 1193.8143 1199.0999 1208.9292 1235.3214 1270.1853 1304.0560 1323.4612 1331.5370 1334.5602 1337.4050 1376.6332 1377.0875 1395.2477 1436.0325 1458.7429 1478.6283 1483.3079 1485.6254 1498.3986 1589.3067 1608.1094 1626.4580 1634.4529 2099.2286 2986.8030 3001.6114 3026.1667 3040.3119 3057.5009 3081.2217 3086.9653 3088.4354 3128.3713 3133.8063 3145.0526 3153.7321 3168.6750 3476.0108
redmass: 9.0857 4.4608 12.6724 5.8798 4.3953 2.8895 3.8105 9.2797 5.7900 2.4625 2.5972 4.8006 7.7856 2.2075 3.0430 3.5892 7.5775 4.2970 8.7268 3.6106 2.8994 8.7909 5.7571 3.9969 3.9232 6.5587 5.0006 6.4443 10.5754 4.7895 3.5844 4.5739 1.8546 1.9742 1.6098 2.4872 1.5737 2.3328 1.2501 2.7912 1.5343 2.2197 1.4886 4.6102 2.1364 1.3244 1.9877 2.1938 3.2162 2.0838 2.0432 2.6460 1.8429 2.0307 1.0890 1.3293 2.7744 1.1850 1.9917 1.7577 1.7400 1.7252 1.4262 1.3475 1.5457 2.2999 3.3069 1.2081 2.2413 1.0808 1.1792 1.4211 1.1183 1.1557 5.7825 5.8652 9.6620 6.0837 12.7368 1.0361 1.0617 1.0634 1.0802 1.1001 1.0986 1.1020 1.1015 1.0849 1.0874 1.0918 1.0959 1.1016 1.0760
irintensity: 1.8840 0.1549 1.9179 0.8651 2.2533 0.3775 3.0755 10.0101 0.5011 0.3405 0.4058 1.6250 3.1504 0.2873 2.9211 1.7399 8.9977 6.0398 1.1715 7.2269 0.6349 6.9411 2.2549 3.7370 18.8542 14.2534 9.3692 0.0075 4.2134 1.2223 14.0950 17.4444 49.4953 15.8034 34.4228 6.4822 68.0571 49.6429 1.1257 0.3406 2.2673 1.1447 0.0398 1.3718 3.2915 0.2179 13.1638 8.5578 1.8248 11.7564 2.7384 14.1970 9.6787 32.0889 3.5971 14.5889 149.2726 1.0197 168.1721 32.0146 27.4641 40.0105 13.8360 1.8574 2.8217 2.0368 0.8228 15.5411 11.4226 10.0263 29.9904 20.9755 17.8528 3.6520 4.0629 12.2294 125.7851 361.0461 20.9350 26.3704 17.0714 6.2464 6.7209 0.4104 30.3241 14.2541 25.7870 2.3117 1.2782 11.0096 19.4933 21.2336 51.6560
temp: 298.150 k
press: 1.00000 atm
elementType: 16 8 8 7 7 6 6 6 6 6 6 6 6 6 6 6 6 6 6 1 1 1 1 1 1 1 1 1 1 1 1 1 1
symmnumber: 1
zpe: 662942.8 jmol-1
zpe.correction: 0.252502 hartree
zpe.thermalcorrener: 0.270539 hartree
zpe.thermalcorrenthalpy: 0.271483 hartree
zpe.thermalcorrgfe: 0.205312 hartree
zpe.sumelectzpe: -1198.526697 hartree
zpe.sumelectthermal: -1198.508659 hartree
zpe.sumelectthermalent: -1198.507715 hartree
zpe.sumelectthermalfe: -1198.573886 hartree
dipole: -3.0189 -0.6387 0.4169
dipole: 3.1137
quadrupole: -127.3327 -124.9490 -122.9595
quadrupole: -12.0966 4.3686 -7.8875
quadrupole: -2.2523 0.1314 2.1209 -12.0966 4.3686 -7.8875
hfenergy: -1198.7791982 hartree
pointgroup: C01 [X(C14H14N2O2S1)]
dipole: 1.1092128 -0.4778652 -0.2049693 debye
polarizability: 194.793057|-6.3353209|195.642254|5.0937383|-9.9462816|142.0413969 unknown
InChI: InChI=1S/C14H14N2O2S/c1-2-14(10-6-4-3-5-7-10)8-11(19-9-15)12(17)16-13(14)18/h3-7,11,16H,2,8H2,1H3
charge 0 multiplicity 1
33 atoms
S  -3.359837 1.247393 0.426169
O  0.784643 -3.030626 0.157174
O  -2.752278 -0.945297 2.282567
N  -0.938299 -1.896167 1.184567
N  -2.550427 3.452582 -1.350637
C  0.277606 -0.76098 -0.716483
C  -1.10269 -0.052973 -0.86943
C  0.815492 -1.24526 -2.107173
C  -1.647134 0.359211 0.503854
C  1.361134 0.171315 -0.09503
C  0.089672 -1.98384 0.209005
C  -1.853631 -0.852084 1.408641
C  -0.12353 -2.167433 -2.913352
C  2.476482 -0.37896 0.589394
C  1.316199 1.577511 -0.289881
C  3.505758 0.45364 1.081181
C  2.347802 2.40953 0.199397
C  3.446351 1.852493 0.891055
C  -2.855693 2.542433 -0.631361
H  -1.818927 -0.740343 -1.353178
H  -1.006311 0.82505 -1.529158
H  1.76795 -1.773206 -1.9203
H  1.059141 -0.340087 -2.695955
H  -0.969441 1.073315 1.004218
H  -1.037293 -2.716947 1.796609
H  -0.396977 -3.068655 -2.33592
H  -1.049901 -1.657261 -3.233022
H  0.391213 -2.508426 -3.829299
H  2.550092 -1.462475 0.73273
H  0.486836 2.044904 -0.83219
H  4.355109 0.007054 1.609757
H  2.289766 3.491358 0.037018
H  4.24452 2.498227 1.272737
