program: Gaussian 09
title: 000213554
version: EM64L-G09RevD.01
frameworkgroup: C1[X(C18H18N2O)]
method: RPBEPBE
basis: SDD
operation: Freq
keyword: #p
keyword: freq=noraman
keyword: PBEPBE/SDD
title: #p freq=noraman PBEPBE/SDD
converged: YES YES NO NO
title: Mulliken charges:
elementType: O N N C C C C C C C C C C C C C C C C C C H H H H H H H H H H H H H H H H H H
charge: -0.301844 -0.157324 -0.146279 -0.330240 -0.369255 -0.256740 0.263922 0.281863 0.466943 0.283279 -0.408449 -0.398402 -0.435155 -0.378309 -0.230811 -0.235951 -0.228829 -0.233270 -0.625746 -0.623212 -0.247542 0.253334 0.259624 0.248903 0.251842 0.251888 0.239609 0.241773 0.226590 0.226484 0.224017 0.223277 0.284118 0.218291 0.220061 0.220291 0.219688 0.274659 0.226901
chargesum: 0.00000
title: Mulliken charges with hydrogens summed into heavy atoms:
elementType: O N N C C C C C C C C C C C C C C C C C C
charge: -0.301844 -0.157324 -0.146279 -0.076906 -0.109631 -0.007837 0.263922 0.281863 0.466943 0.283279 -0.156607 -0.146514 -0.195546 -0.136535 -0.004221 -0.009468 -0.004811 -0.009994 0.096725 0.091426 -0.020641
polarizability: 2.52761235e+02 -1.23719919e+01 2.11713628e+02 2.24446846e+00 -1.31342596e+01 1.48121303e+02
1716.lowfreq: -8.5897 -0.0006 -0.0005 0.0003 6.2362 7.9998 17.3587 24.6145 46.9256
frequency: 16.7827 24.3587 46.9200 58.6895 61.5390 84.9412 92.1358 124.9609 145.1930 182.6432 209.7663 227.7358 231.6657 251.3732 292.7733 314.1505 370.7228 403.0786 407.8983 455.7555 472.6392 488.8320 531.8345 566.8931 584.1732 605.5048 615.7974 620.4062 649.5376 668.2633 705.7866 722.5718 756.1241 761.7396 775.0021 821.3628 833.5958 847.3827 853.9256 875.7711 880.0938 899.2505 917.3100 927.5011 954.3564 969.3231 976.5226 990.2675 990.6168 993.1719 1002.5685 1021.2651 1026.1165 1028.8627 1068.3655 1079.6724 1089.4106 1100.3348 1147.1375 1148.2975 1168.5871 1170.8504 1173.1738 1177.1131 1188.2924 1197.3897 1202.1235 1243.5537 1247.9198 1259.2372 1267.7360 1280.2420 1297.7473 1307.5521 1337.7688 1379.9932 1388.8993 1389.1116 1423.9485 1439.8054 1440.7649 1447.7398 1473.3742 1473.8846 1476.8222 1481.6896 1484.3719 1495.0026 1590.1921 1595.8444 1611.4446 1616.5145 1669.8437 2953.2171 2959.9298 3017.5673 3019.2884 3023.9094 3028.1764 3060.6100 3115.7259 3117.4150 3120.3875 3122.5648 3132.2460 3133.2935 3133.4557 3143.3871 3144.2653 3160.7800 3161.0922
redmass: 3.7562 4.3631 2.2158 2.5154 4.4396 2.5600 3.0415 1.1089 3.2907 5.0172 3.4472 3.0754 4.5531 4.5244 4.8868 4.2466 3.1392 2.8212 3.4479 3.7893 4.4152 4.1289 4.2583 4.9563 5.3723 4.9756 5.7545 5.4601 9.4457 5.1071 1.7014 4.4995 3.2864 1.3779 2.5645 8.9992 3.1249 3.7019 1.2805 4.5336 1.5180 3.8212 1.8700 2.8620 1.4728 3.6264 1.3951 2.4469 1.9637 1.3730 3.7919 2.5846 2.4124 2.5070 1.3618 1.7125 2.0301 1.2182 1.6283 1.3671 1.2595 1.0632 1.5756 1.7070 1.1191 1.5318 2.2806 1.5210 1.8452 2.8228 1.4503 1.5873 1.5665 1.4922 1.3778 7.4175 6.0794 3.8294 1.1438 1.3083 1.8463 2.4380 1.1207 2.3180 1.0514 2.2965 1.0486 1.1648 6.2975 6.8882 6.1636 6.8726 7.0087 1.0377 1.0374 1.0841 1.1012 1.0867 1.1015 1.0879 1.0860 1.0971 1.0866 1.0851 1.0894 1.0950 1.0914 1.0961 1.0952 1.1007 1.1013
irintensity: 0.0662 0.0593 2.2216 0.0608 0.5696 0.0618 0.8762 0.4587 2.1898 1.6287 3.2065 6.4670 0.6177 1.4984 1.3458 1.3467 6.0760 0.1671 1.8652 6.0634 7.0098 1.0863 12.0343 14.7457 3.0553 0.9771 3.5708 14.6704 13.6406 9.6365 51.0479 3.8315 22.3776 83.8648 13.3718 19.8360 5.0753 10.5831 0.4849 3.9043 0.2791 92.9595 30.8835 25.4240 0.7593 13.6765 0.1604 0.4580 0.0312 2.0227 16.4295 8.4028 11.1930 38.8147 7.5747 3.6413 23.5792 0.2442 102.7241 2.3031 2.6339 0.6829 10.1813 11.4344 1.5431 3.9584 1.3243 1.8513 12.1880 37.2360 19.4404 27.3623 20.7958 2.3632 3.1030 0.4429 17.1983 42.3656 22.4423 6.1300 11.3033 2.0351 14.1880 7.4981 6.2768 31.9311 33.9864 31.1753 1.4660 0.7011 19.6452 8.5544 734.0431 48.6414 185.8311 5.2970 60.1575 31.3393 30.3196 30.9388 6.5102 1.8391 0.6995 0.4831 5.5650 4.0247 12.9491 41.0331 26.5979 40.8416 22.0625
temp: 298.150 k
press: 1.00000 atm
elementType: 8 7 7 6 6 6 6 6 6 6 6 6 6 6 6 6 6 6 6 6 6 1 1 1 1 1 1 1 1 1 1 1 1 1 1 1 1 1 1
symmnumber: 1
zpe: 830905.3 jmol-1
zpe.correction: 0.316475 hartree
zpe.thermalcorrener: 0.334729 hartree
zpe.thermalcorrenthalpy: 0.335673 hartree
zpe.thermalcorrgfe: 0.267542 hartree
zpe.sumelectzpe: -879.942196 hartree
zpe.sumelectthermal: -879.923943 hartree
zpe.sumelectthermalent: -879.922999 hartree
zpe.sumelectthermalfe: -879.991129 hartree
dipole: -1.2387 0.8408 -0.0390
dipole: 1.4976
quadrupole: -105.3200 -116.2954 -119.8618
quadrupole: 0.8225 -1.4609 -2.6328
quadrupole: 8.5057 -2.4697 -6.0361 0.8225 -1.4609 -2.6328
hfenergy: -880.2586713 hartree
pointgroup: C01 [X(C18H18N2O1)]
dipole: 0.494188 0.3102164 0.0818805 debye
polarizability: 253.3053682|11.5732091|201.172596|2.6696013|26.405749|158.1182019 unknown
InChI: InChI=1S/C18H18N2O/c1-20(2)18-19-16-15(12-8-4-3-5-9-12)13-10-6-7-11-14(13)17(16)21-18/h3-11,15-17H,1-2H3
charge 0 multiplicity 1
39 atoms
O  2.512835 -0.255002 1.090622
N  1.499223 -1.505985 -0.622698
N  3.894885 -1.261537 -0.541069
C  0.372017 -1.03981 0.233626
C  -0.680672 -0.194725 -0.585435
C  1.031482 -0.05447 1.27808
C  -0.352386 1.246457 -0.209197
C  0.590794 1.326575 0.843089
C  -2.126071 -0.611693 -0.30197
C  2.614765 -1.046535 -0.094542
C  -0.885597 2.426472 -0.771156
C  1.014262 2.573735 1.348513
C  -2.748778 -1.582124 -1.12897
C  -2.851389 -0.100187 0.80505
C  -0.461852 3.680387 -0.27236
C  0.483571 3.75578 0.782197
C  -4.060291 -2.032486 -0.859232
C  -4.163076 -0.549101 1.07862
C  4.10856 -2.096947 -1.729326
C  5.068853 -0.645196 0.086931
C  -4.773282 -1.517599 0.24831
H  -0.116545 -1.908938 0.708474
H  -0.474169 -0.374937 -1.656698
H  0.838687 -0.286646 2.338064
H  -1.622273 2.372087 -1.580694
H  1.751237 2.624827 2.157681
H  -2.197874 -1.987216 -1.987059
H  -2.393017 0.662466 1.445654
H  -0.866785 4.603253 -0.703366
H  0.801969 4.734772 1.157752
H  -4.525557 -2.780893 -1.511029
H  -4.710347 -0.141471 1.936552
H  3.137684 -2.496442 -2.058237
H  4.790615 -2.937809 -1.494825
H  4.55354 -1.503699 -2.553043
H  5.586807 0.028432 -0.625386
H  5.787078 -1.423799 0.412662
H  4.757392 -0.060634 0.963597
H  -5.791698 -1.863261 0.458817
