program: Gaussian 09
title: 000213529
version: EM64L-G09RevD.01
frameworkgroup: C1[X(C14H16F3NO)]
method: RPBEPBE
basis: SDD
operation: Freq
keyword: #p
keyword: freq=noraman
keyword: PBEPBE/SDD
title: #p freq=noraman PBEPBE/SDD
converged: YES YES NO NO
title: Mulliken charges:
elementType: F F F O N C C C C C C C C C C C C C C H H H H H H H H H H H H H H H H
charge: -0.167007 -0.168774 -0.164996 -0.283793 -0.084128 -0.135400 -0.412422 -0.333299 -0.321779 0.446853 -0.414944 -0.481510 -0.419450 0.306029 -0.059785 -0.208455 -0.384994 0.237148 -0.574544 0.216829 0.205615 0.230331 0.229803 0.193505 0.221191 0.195269 0.192587 0.215127 0.302237 0.241441 0.237113 0.236165 0.267262 0.219948 0.220829
chargesum: 0.00000
title: Mulliken charges with hydrogens summed into heavy atoms:
elementType: F F F O N C C C C C C C C C C C C C C
charge: -0.167007 -0.168774 -0.164996 -0.283793 -0.084128 0.081429 0.023524 0.090009 0.094681 0.446853 -0.007230 -0.179272 -0.178009 0.306029 0.177328 0.027710 -0.117732 0.237148 -0.133767
polarizability: 2.17318490e+02 -1.59659532e+01 1.53772456e+02 3.73850177e+00 3.38106375e+00 1.11934960e+02
1716.lowfreq: -11.3101 -3.2232 0.0006 0.0008 0.0009 4.1042 9.6142 15.9792 50.2269
frequency: -3.8576 15.3671 50.1306 58.3478 77.7566 83.1419 122.1600 133.3931 161.2591 202.4885 223.3003 239.5046 286.5796 299.6568 310.6675 322.4531 347.9773 368.5183 392.7387 402.9222 431.8346 465.8497 482.2314 503.4234 516.6890 553.6306 608.6724 613.5475 625.3222 658.0037 702.8858 717.0002 787.9466 809.1491 832.5566 860.3201 905.6858 918.3221 924.9932 936.4394 951.8850 961.7053 984.5527 986.7389 989.8219 993.1360 1006.6402 1009.9468 1016.0223 1049.7512 1055.8034 1064.8959 1088.8728 1104.4383 1128.0001 1131.3803 1161.5389 1185.1475 1186.9049 1203.3953 1230.0120 1245.6578 1271.3570 1274.1675 1283.3814 1301.3675 1308.1987 1322.3647 1346.1726 1351.4555 1364.9403 1380.3257 1393.9084 1428.4286 1436.3400 1448.2591 1453.1454 1458.0388 1467.9559 1480.6654 1603.6028 1620.5744 1659.0977 2861.6222 2862.9802 2876.2677 2942.0117 2968.3681 2988.6467 3032.2532 3043.7411 3086.2887 3089.2154 3105.4473 3123.3185 3153.1443 3173.4335 3176.9671 3197.1730
redmass: 14.6538 5.8223 3.3614 4.1874 4.6720 2.9721 6.1053 3.4839 3.1153 3.2879 6.5010 3.0201 2.3607 5.9981 4.1518 7.9704 5.4515 3.5740 2.9643 2.5063 5.5952 3.7324 3.0874 3.2432 8.3360 2.5900 10.9220 3.2822 3.3655 2.7682 2.2778 4.6004 2.6836 1.5773 3.1439 3.1921 1.9442 2.0028 1.4819 1.4418 1.3842 2.1171 4.1555 2.1882 6.0739 1.5756 6.3786 2.1262 1.3511 2.6815 3.5304 3.2415 2.2762 1.9369 2.4970 2.0709 2.6633 1.2457 1.3028 1.2680 1.2125 1.3973 1.3075 1.2945 1.6778 1.5502 1.5383 1.2412 1.3981 1.5001 1.3608 1.4909 6.5861 1.2065 3.1199 1.0873 1.0943 1.0867 1.1013 2.6217 6.2989 6.3630 4.7489 1.0689 1.0708 1.0681 1.0830 1.0662 1.0884 1.0898 1.0894 1.0601 1.0980 1.0940 1.0891 1.0918 1.0926 1.0972 1.1143
irintensity: 0.0044 0.3607 0.0242 0.0791 0.5931 0.1695 0.2272 2.3621 0.3507 1.8662 2.4922 2.6445 4.8925 1.2774 4.5721 6.4143 4.0281 2.9525 0.8283 4.1707 0.5093 0.4137 2.3124 4.2769 2.0770 11.0095 22.1627 6.4580 3.9255 4.8264 27.5525 15.4119 2.6411 65.2856 2.6059 38.0465 6.6986 10.0421 4.2909 38.8884 82.4364 18.4906 143.1751 46.8711 8.1610 23.9551 169.7748 34.6046 7.8377 15.3742 174.5121 8.9231 7.7566 15.4349 56.0226 4.5890 4.7802 42.5739 17.2628 53.9969 15.1293 34.4878 17.6800 20.6923 135.6214 16.3951 54.5630 25.0241 8.2049 6.2989 6.0429 0.1616 2.4082 20.2947 27.1795 0.4238 11.1889 4.2558 11.8598 7.8110 3.6059 4.5712 6.8806 38.1961 41.7921 137.6060 36.5592 73.7468 22.6875 28.7775 27.1339 11.6661 29.5596 9.7931 9.0748 10.6944 0.1094 8.1775 26.8751
temp: 298.150 k
press: 1.00000 atm
elementType: 9 9 9 8 7 6 6 6 6 6 6 6 6 6 6 6 6 6 6 1 1 1 1 1 1 1 1 1 1 1 1 1 1 1 1
symmnumber: 1
zpe: 717901.4 jmol-1
zpe.correction: 0.273434 hartree
zpe.thermalcorrener: 0.290407 hartree
zpe.thermalcorrenthalpy: 0.291351 hartree
zpe.thermalcorrgfe: 0.227260 hartree
zpe.sumelectzpe: -971.125932 hartree
zpe.sumelectthermal: -971.108960 hartree
zpe.sumelectthermalent: -971.108015 hartree
zpe.sumelectthermalfe: -971.172106 hartree
dipole: 4.5475 2.9476 0.0233
dipole: 5.4192
quadrupole: -116.5755 -104.5662 -113.4584
quadrupole: -13.3571 -0.8337 0.3291
quadrupole: -5.0422 6.9672 -1.9250 -13.3571 -0.8337 0.3291
hfenergy: -971.3993661 hartree
pointgroup: C01 [X(C14H16F3N1O1)]
dipole: 1.7354053 0.7399328 -0.9933144 debye
polarizability: 218.6933294|-9.3355585|132.6786611|9.085163|-20.7464487|131.6539155 unknown
InChI: InChI=1S/C14H16F3NO/c1-2-6-18-7-8-19-13(10-18)11-4-3-5-12(9-11)14(15,16)17/h2-5,9,13H,1,6-8,10H2
charge 0 multiplicity 1
35 atoms
F  -5.222701 -0.77668 0.150013
F  -3.508181 -2.204579 0.563336
F  -4.053101 -0.626321 2.088035
O  0.859493 0.440795 1.665106
N  3.045694 0.113685 -0.198359
C  0.77578 0.983104 0.297661
C  1.638399 0.121071 -0.660655
C  3.135797 -0.428041 1.180623
C  2.262514 0.413724 2.121474
C  -0.684357 0.997776 -0.115663
C  3.959788 -0.56565 -1.152321
C  -1.611126 0.112255 0.4758
C  -1.122504 1.879194 -1.135809
C  -2.956844 0.108204 0.039334
C  5.415094 -0.278195 -0.844052
C  -2.465938 1.86932 -1.567523
C  -3.393459 0.980227 -0.982883
C  -3.917172 -0.84584 0.688877
C  6.388416 -1.218154 -0.754162
H  1.190871 2.015723 0.290749
H  1.195677 -0.906616 -0.697592
H  1.593328 0.549602 -1.679271
H  4.18859 -0.389051 1.514578
H  2.801903 -1.495804 1.222399
H  2.229094 -0.018728 3.134607
H  2.655304 1.451207 2.168166
H  3.7922 -1.67157 -1.187575
H  3.72392 -0.170597 -2.161984
H  -1.274104 -0.547212 1.280446
H  -0.412539 2.582533 -1.588386
H  5.657859 0.78611 -0.709563
H  -2.79423 2.556899 -2.353621
H  -4.437221 0.966852 -1.309425
H  7.432905 -0.9468 -0.564664
H  6.168746 -2.286747 -0.874294
