program: Gaussian 09
title: 000213545
version: EM64L-G09RevD.01
frameworkgroup: C1[X(C16H15N3O2S)]
method: RPBEPBE
basis: SDD
operation: Freq
keyword: #p
keyword: freq=noraman
keyword: PBEPBE/SDD
title: #p freq=noraman PBEPBE/SDD
converged: YES YES NO NO
title: Mulliken charges:
elementType: S O O N N N C C C C C C C C C C C C C C C C H H H H H H H H H H H H H H H
charge: 0.217345 -0.273887 -0.267609 -0.154457 -0.258301 -0.429446 0.352774 0.071993 0.067693 0.454946 -0.634696 -0.756607 -0.358252 -0.387282 0.239125 -0.214776 -0.210908 -0.250398 -0.259915 -0.204482 -0.134720 -0.496201 0.268986 0.233269 0.247030 0.304713 0.208790 0.247079 0.338673 0.283881 0.263805 0.229851 0.228410 0.231025 0.283623 0.250061 0.268862
chargesum: 0.00000
title: Mulliken charges with hydrogens summed into heavy atoms:
elementType: S O O N N N C C C C C C C C C C C C C C C C
charge: 0.217345 -0.273887 -0.267609 -0.154457 -0.258301 -0.090772 0.352774 0.071993 0.067693 0.454946 0.114590 0.003975 -0.074371 -0.123477 0.239125 0.015075 0.017502 -0.019372 -0.259915 0.079142 0.115341 -0.227339
polarizability: 3.74836263e+02 -3.21397273e+00 2.16248866e+02 -1.54419289e+01 2.66764691e+00 1.24912313e+02
1716.lowfreq: -51.8493 -4.3517 -0.0016 -0.0013 -0.0009 2.9607 4.5779 27.8247 31.6889
frequency: -51.7211 27.7790 31.6610 43.2522 56.3162 71.6047 83.6230 109.4250 125.5825 140.6904 155.0563 169.7418 191.6113 219.5225 250.5962 266.8716 287.3839 291.5355 342.8252 377.0561 383.7850 405.9120 408.8973 431.8266 455.4307 500.7853 558.4124 562.5309 575.1568 603.1000 615.4477 621.2849 644.3762 661.8847 680.7372 690.2087 698.4913 701.6300 712.8235 724.2163 762.6886 799.1967 817.2755 842.6239 850.4917 857.6139 908.7322 916.7718 929.7768 972.1981 985.9720 991.7653 1005.2332 1021.2239 1032.3580 1039.1502 1057.0193 1060.9379 1083.2072 1093.7179 1105.6361 1136.0240 1161.4483 1172.6749 1185.1372 1187.8656 1211.3859 1270.4438 1287.3972 1318.9279 1337.9789 1339.6994 1367.1488 1385.7365 1404.3094 1432.8545 1441.3811 1446.5913 1462.1545 1467.5073 1475.6936 1485.9992 1492.9901 1515.8220 1540.6780 1573.9163 1590.3451 1607.0588 1622.3200 1647.0096 2981.0251 2993.3177 3071.4305 3091.0716 3111.7839 3130.2710 3131.1194 3141.0564 3154.3868 3167.0864 3179.3871 3188.3211 3198.9881 3236.5462 3437.7323
redmass: 1.2009 5.9899 5.0171 4.8147 4.3396 4.9292 5.2413 4.6863 1.8226 3.7863 2.1481 4.2419 5.5903 4.6155 4.9741 4.4401 4.2761 5.5165 3.3917 6.0602 6.8105 7.6733 2.9657 5.0289 5.9056 3.3863 3.2383 6.3843 5.6636 6.9776 6.3714 5.4358 5.3362 1.4587 5.2060 5.6993 2.4703 1.9932 2.1011 4.9721 1.7021 5.0073 5.1154 1.3899 4.1958 1.3163 2.0938 1.6541 1.4031 1.3659 4.5743 1.4129 3.6508 2.3221 1.9547 1.4865 2.2488 2.4929 1.5278 1.3467 1.5679 2.2006 3.5468 1.0556 1.5070 1.8155 1.6939 2.8805 3.2521 1.4840 2.6189 3.4427 3.2750 8.6951 1.2974 1.1484 1.2321 1.8759 6.3341 1.1088 1.0881 2.3727 1.1551 2.0984 5.9652 5.4610 6.4568 6.7276 9.6623 8.6460 1.0417 1.0384 1.0948 1.0926 1.1002 1.0872 1.0986 1.0891 1.0941 1.0993 1.0898 1.0964 1.0977 1.1006 1.0762
irintensity: 2.6782 0.9737 2.0255 1.5982 3.7511 1.2483 5.1297 2.8314 4.9387 3.2474 1.3654 8.7813 0.8050 1.8598 3.6229 2.7379 3.6284 8.8733 9.5533 6.9248 5.0966 2.8456 0.9712 13.1004 4.3383 13.1240 6.0519 38.6936 3.8228 7.8776 3.4347 17.5533 11.6751 61.9667 19.9028 0.5019 46.1942 16.0198 85.4229 61.6470 64.9541 7.6353 20.2438 1.9511 4.5093 11.1896 3.9321 8.1581 1.2162 0.7118 0.3251 0.4559 8.4985 37.9051 1.8754 8.2091 5.1102 18.5136 9.7465 3.5889 11.0277 18.4104 52.4478 0.1266 3.8077 10.2466 12.5058 120.2241 176.1069 50.7680 17.2861 105.2270 204.5871 1.8368 59.7963 32.1548 9.4308 18.2858 22.5391 97.0301 2.1925 174.9164 26.6720 269.4309 78.0528 169.8144 1.5412 97.8510 180.4352 9.0267 61.7526 19.2424 13.2739 13.6478 15.9925 5.3465 7.9198 11.6053 25.6861 22.8892 7.1742 1.7700 0.7550 0.3514 52.5498
temp: 298.150 k
press: 1.00000 atm
elementType: 16 8 8 7 7 7 6 6 6 6 6 6 6 6 6 6 6 6 6 6 6 6 1 1 1 1 1 1 1 1 1 1 1 1 1 1 1
symmnumber: 1
zpe: 734475.3 jmol-1
zpe.correction: 0.279747 hartree
zpe.thermalcorrener: 0.299359 hartree
zpe.thermalcorrenthalpy: 0.300303 hartree
zpe.thermalcorrgfe: 0.229972 hartree
zpe.sumelectzpe: -1329.885629 hartree
zpe.sumelectthermal: -1329.866017 hartree
zpe.sumelectthermalent: -1329.865073 hartree
zpe.sumelectthermalfe: -1329.935404 hartree
dipole: -1.0821 2.2336 0.9045
dipole: 2.6416
quadrupole: -101.7855 -130.9902 -136.7276
quadrupole: -13.2164 0.4507 1.7662
quadrupole: 21.3823 -7.8224 -13.5599 -13.2164 0.4507 1.7662
hfenergy: -1330.165376 hartree
pointgroup: C01 [X(C16H15N3O2S1)]
dipole: 0.4243598 -0.9464349 -0.0654709 debye
polarizability: 374.9725482|-9.5700911|201.0147326|10.9762348|34.2225927|140.0101612 unknown
InChI: InChI=1S/C16H15N3O2S/c1-11-14(17-15(20)13-9-6-10-22-13)16(21)19(18(11)2)12-7-4-3-5-8-12/h3-10,17H,1-2H3
charge 0 multiplicity 1
37 atoms
S  -4.326735 1.050477 1.512259
O  0.548214 1.767855 0.475501
O  -2.802229 -1.451239 -1.331342
N  1.621737 -1.514509 -0.422758
N  1.894403 -0.129213 -0.164217
N  -1.694021 -0.065568 0.203214
C  0.209965 -1.678728 -0.368062
C  -0.369654 -0.453905 -0.064846
C  0.675551 0.55927 0.102433
C  3.208525 0.302497 0.188586
C  2.391117 -2.096011 -1.55622
C  -0.409557 -3.032889 -0.547608
C  3.56207 1.660896 -0.01586
C  4.14226 -0.603395 0.755295
C  -2.840404 -0.564081 -0.418475
C  4.85344 2.099984 0.343009
C  5.436373 -0.151818 1.090745
C  5.799773 1.199311 0.886041
C  -4.129691 0.009123 0.034861
C  -5.354161 -0.172852 -0.600557
C  -6.450747 0.501217 0.039004
C  -6.078457 1.204783 1.176119
H  3.468487 -1.963307 -1.376479
H  2.175826 -3.173456 -1.611495
H  2.119065 -1.61646 -2.51643
H  -1.149941 -3.014351 -1.364796
H  0.345478 -3.814957 -0.727198
H  -0.968427 -3.308979 0.365795
H  -1.756794 0.817451 0.728316
H  2.824702 2.353708 -0.427714
H  3.840111 -1.635617 0.960523
H  5.121888 3.151064 0.190875
H  6.154518 -0.854207 1.528256
H  6.803092 1.547495 1.153492
H  -5.435731 -0.778896 -1.505236
H  -7.479073 0.468063 -0.327876
H  -6.69387 1.795944 1.852346
