program: Gaussian 09
title: 000213565
version: EM64L-G09RevD.01
frameworkgroup: C1[X(C20H23N5)]
method: RPBEPBE
basis: SDD
operation: Freq
keyword: #pfreq=noraman
keyword: PBEPBE/SDD
title: #p freq=noraman PBEPBE/SDD
converged: YES YES NO NO
title: Mulliken charges:
elementType: N N N N N C C C C C C C C C C C C C C C C C C C C H H H H H H H H H H H H H H H H H H H H H H H
charge: -0.324067 -0.325416 -0.120114 -0.116175 -0.115115 -0.546850 -0.550475 -0.409254 -0.402126 0.498905 0.497099 0.050607 0.062523 -0.436163 -0.376415 -0.408596 -0.403829 -0.222630 -0.233481 -0.215721 -0.228187 0.074370 -0.255159 -0.255687 -0.752907 0.208684 0.239657 0.227512 0.202619 0.233104 0.252275 0.255971 0.234962 0.321061 0.315911 0.232310 0.238653 0.240868 0.230014 0.224695 0.229098 0.230136 0.224500 0.228372 0.228418 0.237568 0.240173 0.238303
chargesum: 0.00000
title: Mulliken charges with hydrogens summed into heavy atoms:
elementType: N N N N N C C C C C C C C C C C C C C C C C C C C
charge: -0.003007 -0.009505 -0.120114 -0.116175 -0.115115 -0.098509 -0.120344 0.076124 0.088808 0.498905 0.497099 0.050607 0.062523 -0.203853 -0.137762 -0.167728 -0.173814 0.002065 -0.004384 0.014415 -0.003687 0.074370 -0.026787 -0.027269 -0.036864
polarizability: 3.38136251e+02 -8.15244395e+00 2.88268933e+02 2.35966679e+01 2.37811089e+01 1.36313287e+02
1716.lowfreq: -19.8722 -4.6069 -0.0004 -0.0003 -0.0001 4.6118 6.0336 18.1233 18.5002
frequency: -19.8462 18.0510 18.1793 21.1362 26.0402 39.8688 43.9524 53.2299 70.4930 96.7180 100.0468 158.8896 164.8958 167.6102 192.0506 230.0433 236.7951 255.7940 299.4977 324.6193 337.8605 351.5559 366.0194 403.6752 408.0534 471.4482 498.3260 502.0303 506.3453 540.3449 560.5825 585.6513 598.3764 599.4779 614.2121 617.2365 617.9857 643.9029 645.1168 704.9716 709.6029 714.0952 756.3382 759.0018 785.4850 795.5970 799.6852 817.5884 819.2967 852.0088 861.3450 897.8807 911.6396 918.4624 945.6044 954.1226 974.6020 980.0877 989.8494 990.2260 993.0631 996.4192 1005.0317 1011.7958 1016.4178 1020.7178 1025.4411 1026.2295 1047.5141 1051.4658 1087.5767 1097.9251 1119.3681 1143.3333 1171.2410 1171.9917 1185.3185 1187.7284 1189.4540 1196.6171 1215.4421 1215.6499 1223.3082 1284.1081 1290.0623 1292.7358 1302.1274 1327.1564 1327.4650 1330.8955 1342.0568 1361.6457 1366.8577 1381.8441 1382.1133 1389.0657 1417.3760 1439.8273 1440.3499 1450.2439 1453.8525 1457.8688 1462.6292 1478.9840 1480.8202 1482.1465 1483.4770 1497.7150 1513.0242 1530.5264 1587.4984 1591.9769 1592.6742 1613.4004 1613.6431 2990.1408 2995.3981 2996.0071 2999.7658 3014.7780 3051.6831 3053.1023 3083.9607 3085.8227 3092.8629 3111.8105 3115.0648 3115.7530 3119.7489 3130.6221 3130.9116 3132.2866 3141.5716 3143.8609 3160.8842 3161.7675 3553.7813 3567.3326
redmass: 1.0180 3.7631 4.9832 4.8589 5.0506 3.3470 4.4168 3.6158 3.8644 4.7444 4.7681 3.4018 7.4111 4.0040 4.3628 2.9436 3.6341 3.9307 3.2132 4.0277 2.4794 2.9376 3.6077 2.8098 2.8685 4.2844 3.7631 3.4705 4.1430 4.7671 1.2507 1.4767 4.0302 3.7728 2.5616 6.2512 6.1689 3.4282 3.3358 1.7582 1.8218 11.4998 1.8329 1.8365 1.2997 1.3953 6.1512 3.9270 3.7026 1.2485 1.2409 12.6701 1.5201 1.4471 5.3441 2.3854 1.3923 1.3962 6.0133 5.0627 1.3485 1.4784 2.3005 3.9976 1.9843 2.1456 2.1924 2.1872 2.0295 1.6477 1.6119 1.5296 1.9300 3.9494 1.0544 1.0561 1.1187 1.1281 1.6136 2.1768 2.4952 2.4659 2.3696 1.4938 1.3966 1.3442 1.2269 1.3830 1.3950 1.3590 2.0433 1.3732 1.2856 7.7627 7.7155 1.3063 2.5933 2.1623 2.1681 1.1578 1.1558 1.0927 1.1541 1.1446 1.2470 1.9659 2.0598 2.7766 2.3617 5.1330 5.3236 5.9960 5.9803 6.1764 6.1459 1.0607 1.0401 1.0591 1.0668 1.0596 1.1020 1.0991 1.1060 1.0921 1.0997 1.0875 1.0855 1.0878 1.0863 1.1018 1.0910 1.0910 1.0959 1.0958 1.1014 1.1014 1.0764 1.0770
irintensity: 0.1040 0.0762 0.0259 0.0003 0.0215 0.0281 0.3474 0.0151 0.0195 0.3071 0.2301 3.8228 1.2429 4.4451 0.5880 2.8509 0.9815 3.9263 0.5289 1.6038 0.5200 2.0734 0.2121 0.0335 0.0347 12.8906 4.8096 23.9207 7.1482 15.3521 102.9241 32.5916 10.9793 13.0567 52.4201 0.9583 0.9190 13.4949 6.8570 105.1268 0.2926 0.1564 70.4325 13.3765 13.8473 1.9871 22.5193 7.6338 2.4147 2.4276 0.3420 14.9327 3.3295 0.4269 0.4880 6.8990 0.0940 0.0817 0.0933 0.1836 0.2482 0.5825 1.5789 17.9499 1.7920 3.6934 10.1442 10.7084 13.2111 17.2201 7.1001 7.6132 42.6942 0.9268 0.2842 0.1941 0.2428 0.4091 31.0957 1.2756 0.2563 2.3509 42.3886 10.3325 8.0441 7.2752 43.2237 2.3605 13.2286 12.6991 2.2631 37.6624 56.6685 0.1607 0.0540 7.6346 255.4858 0.5733 11.8073 53.7584 85.3122 19.3405 26.2002 9.6539 22.8590 13.2806 57.5060 241.2041 5.2385 1119.9859 378.1847 9.1302 9.9842 1.0128 6.9025 21.6638 10.9793 13.3384 48.3980 48.9288 6.5182 18.1808 22.5193 15.7681 7.3296 11.3557 7.1502 8.3305 3.7314 10.8833 2.2708 23.5255 87.9309 11.9521 10.3845 33.0543 51.9663 55.2693
temp: 298.150 k
press: 1.00000 atm
elementType: 7 7 7 7 7 6 6 6 6 6 6 6 6 6 6 6 6 6 6 6 6 6 6 6 6 1 1 1 1 1 1 1 1 1 1 1 1 1 1 1 1 1 1 1 1 1 1 1
symmnumber: 1
zpe: 1038584.3 jmol-1
zpe.correction: 0.395576 hartree
zpe.thermalcorrener: 0.417976 hartree
zpe.thermalcorrenthalpy: 0.418920 hartree
zpe.thermalcorrgfe: 0.339183 hartree
zpe.sumelectzpe: -1047.922225 hartree
zpe.sumelectthermal: -1047.899825 hartree
zpe.sumelectthermalent: -1047.898881 hartree
zpe.sumelectthermalfe: -1047.978618 hartree
dipole: -1.7199 0.1269 -0.3502
dipole: 1.7598
quadrupole: -147.6203 -127.3126 -152.6216
quadrupole: 0.1013 3.7306 5.1232
quadrupole: -5.1021 15.2056 -10.1034 0.1013 3.7306 5.1232
hfenergy: -1048.3178011 hartree
pointgroup: C01 [X(C20H23N5)]
dipole: -0.6318039 0.2526583 -0.1278269 debye
polarizability: 328.9020244|-22.6082049|294.5351012|29.7257231|25.2761419|139.2813453 unknown
InChI: InChI=1S/C20H23N5/c1-16-23-19(21-14-12-17-8-4-2-5-9-17)25-20(24-16)22-15-13-18-10-6-3-7-11-18/h2-11,21-22H,12-15H2,1H3
charge 0 multiplicity 1
48 atoms
N  3.035597 1.54498 -0.25419
N  1.327804 -2.845268 -0.545204
N  2.086132 -0.610865 -0.380256
N  3.595132 -2.521279 -0.114215
N  4.4753 -0.266712 0.044067
C  0.873604 2.353931 0.772999
C  -0.943449 -2.713423 0.538976
C  1.7597 2.223201 -0.50295
C  -0.077559 -2.48001 -0.737742
C  -0.434684 3.069061 0.475413
C  -2.393521 -2.320905 0.304142
C  3.188188 0.183484 -0.196069
C  2.353245 -1.955347 -0.341959
C  -0.65556 4.404735 0.898527
C  -1.456889 2.418841 -0.266429
C  -2.851549 -1.015927 0.620528
C  -3.307214 -3.232765 -0.286311
C  -1.863576 5.073686 0.59346
C  -2.665659 3.082055 -0.572727
C  -4.184597 -0.629495 0.353347
C  -4.641506 -2.852218 -0.55444
C  4.611424 -1.626122 0.074118
C  -2.873643 4.414195 -0.144001
C  -5.084676 -1.547061 -0.236274
C  5.991859 -2.183587 0.307188
H  1.443057 2.893215 1.552771
H  0.686057 1.329198 1.14467
H  -0.504232 -2.122523 1.363493
H  -0.874142 -3.781266 0.824604
H  1.97432 3.226393 -0.914169
H  1.202758 1.653541 -1.267091
H  -0.107018 -1.41453 -1.017304
H  -0.498542 -3.066507 -1.576909
H  3.887595 2.080988 -0.083669
H  1.601014 -3.828011 -0.483846
H  0.121704 4.921196 1.475772
H  -1.306294 1.38497 -0.602034
H  -2.163935 -0.301315 1.089644
H  -2.97318 -4.250205 -0.527771
H  -2.017434 6.104536 0.932656
H  -3.441905 2.560424 -1.144675
H  -4.519172 0.381494 0.613197
H  -5.334929 -3.571475 -1.005157
H  -3.81103 4.930376 -0.379916
H  -6.120046 -1.251409 -0.439851
H  6.479261 -2.397638 -0.662863
H  6.612866 -1.452047 0.846714
H  5.932824 -3.131289 0.865736
