program: Gaussian 09
title: 000213519
version: EM64L-G09RevD.01
frameworkgroup: C1[X(C10H17N4O5P)]
method: RPBEPBE
basis: SDD
operation: Freq
keyword: #p
keyword: freq=noraman
keyword: PBEPBE/SDD
title: #p freq=noraman PBEPBE/SDD
converged: YES YES NO NO
title: Mulliken charges:
elementType: P O O O O O N N N N C C C C C C C C C C H H H H H H H H H H H H H H H H H
charge: 1.440122 -0.554048 -0.485774 -0.576962 -0.210262 -0.256774 -0.835478 -0.418440 0.015487 -0.058700 -0.246846 -0.216016 0.341786 -0.648381 -0.665000 0.024992 0.337784 -0.341899 -0.350452 -0.530604 0.365693 0.225768 0.225554 0.210031 0.261826 0.219348 0.264820 0.211486 0.243978 0.225300 0.206401 0.336039 0.260785 0.266499 0.231209 0.253529 0.227200
chargesum: 0.00000
title: Mulliken charges with hydrogens summed into heavy atoms:
elementType: P O O O O O N N N N C C C C C C C C C C
charge: 1.440122 -0.554048 -0.485774 -0.576962 -0.210262 -0.256774 -0.469785 -0.082402 0.015487 -0.058700 0.204475 0.255841 0.341786 0.047274 0.010679 0.024992 0.337784 -0.081114 -0.083953 0.181334
polarizability: 2.81090960e+02 -1.19000783e+01 1.77732032e+02 9.63353431e-01 3.48407997e+00 1.17232301e+02
1716.lowfreq: -12.3780 -4.9825 -0.0014 -0.0007 -0.0001 2.4131 17.2012 18.0414 26.4245
frequency: 16.3394 18.0363 26.1280 28.2393 37.6241 52.3993 72.4561 78.9674 90.6082 96.6124 114.6414 131.5018 152.1187 175.9871 193.0025 204.9288 223.9817 230.1366 243.0193 255.4225 268.7725 286.1567 333.0339 352.9978 385.6249 399.0852 405.9948 417.1663 448.1832 474.6936 513.7341 542.3807 552.5870 606.8176 614.6518 625.6553 663.8347 694.2339 719.9000 776.0856 789.1098 792.4656 800.5597 818.1941 869.0235 877.1661 889.2709 893.1785 927.6106 958.6112 998.0400 1008.9925 1014.8714 1029.4350 1066.6061 1095.8555 1106.5941 1112.6529 1132.2264 1137.4955 1148.9656 1156.6300 1203.5394 1234.2570 1260.4124 1268.2680 1276.8047 1344.9891 1349.4861 1355.4753 1357.3149 1370.7908 1389.5050 1392.5590 1425.8908 1444.6279 1456.8273 1459.9224 1467.5081 1467.7270 1469.6363 1476.8883 1478.5339 1484.8368 1488.8501 1517.0478 1568.8275 1657.4698 2968.2008 2987.6543 2990.8587 2995.6272 3005.4405 3060.2347 3067.7709 3077.3283 3083.8007 3091.6057 3110.4513 3112.7351 3136.2004 3149.5554 3156.7952 3523.4194 3534.1634
redmass: 3.3916 4.0472 3.2502 4.9383 3.4218 2.4399 4.0355 3.2322 6.9548 4.5451 4.9990 5.2404 3.8992 5.3919 3.9876 2.8836 1.4691 2.1627 1.5363 1.3555 3.6249 5.5838 6.2528 6.2195 5.8816 5.2711 4.7353 4.3560 4.6210 4.5731 2.4463 5.9075 1.4090 5.6311 5.1354 1.4996 5.5770 8.0978 6.8400 7.1008 8.3119 6.2142 1.1698 1.0939 3.3649 4.7351 3.0227 2.0072 1.4035 8.6206 4.0632 3.4025 2.7552 4.1055 10.5925 2.1584 2.3382 1.2575 1.4136 1.8641 1.5756 1.4933 3.1647 2.7709 1.1524 1.1161 3.2747 1.3839 2.1760 1.5619 1.3128 1.7652 1.2333 1.2415 1.8498 1.6319 1.0400 1.0401 1.0550 1.0760 1.0769 1.2176 2.4180 1.0758 1.0542 3.5531 5.6187 7.8631 1.0326 1.0360 1.0519 1.0423 1.0621 1.1046 1.1064 1.1030 1.0978 1.0978 1.1035 1.1026 1.1000 1.0921 1.0935 1.0768 1.0760
irintensity: 0.7640 1.4863 0.5424 0.3687 0.3054 1.0806 1.5505 6.3815 7.4388 3.8622 3.0000 5.2995 0.5148 4.0019 0.7045 13.5091 0.3267 2.2443 1.6303 7.5935 11.2868 6.3267 13.7158 1.2509 22.9622 32.0749 22.6337 0.6284 5.2893 36.1610 5.6366 6.9828 74.3667 64.8388 28.9843 116.7737 97.1495 99.5105 76.5294 38.9181 9.8767 43.3698 4.0039 3.6500 182.9875 75.0196 123.7217 29.5307 7.6831 75.7907 29.9041 168.3796 122.5513 59.4823 144.8256 18.4539 32.7120 0.1176 3.2682 176.8341 12.4329 131.0938 101.5939 137.2319 3.8746 1.7126 106.1235 288.5095 4.1207 17.9803 3.0802 471.0106 28.3652 24.2480 79.2327 9.2706 9.6051 13.2558 21.8441 6.1388 87.7701 180.5147 877.1451 6.2682 9.3229 109.3511 1.6071 183.3089 54.9056 22.8787 22.2251 28.2024 35.0930 40.4330 4.1056 7.7720 35.4465 27.6280 27.2725 30.0361 24.3665 16.1675 14.9030 16.2426 62.0338
temp: 298.150 k
press: 1.00000 atm
elementType: 15 8 8 8 8 8 7 7 7 7 6 6 6 6 6 6 6 6 6 6 1 1 1 1 1 1 1 1 1 1 1 1 1 1 1 1 1
symmnumber: 1
zpe: 740890.0 jmol-1
zpe.correction: 0.282190 hartree
zpe.thermalcorrener: 0.305138 hartree
zpe.thermalcorrenthalpy: 0.306082 hartree
zpe.thermalcorrgfe: 0.225324 hartree
zpe.sumelectzpe: -1326.046248 hartree
zpe.sumelectthermal: -1326.023300 hartree
zpe.sumelectthermalent: -1326.022356 hartree
zpe.sumelectthermalfe: -1326.103115 hartree
dipole: -3.3613 0.4240 -5.4374
dipole: 6.4065
quadrupole: -87.2473 -117.7232 -135.1410
quadrupole: -13.5490 -14.6902 -0.7749
quadrupole: 26.1232 -4.3527 -21.7705 -13.5490 -14.6902 -0.7749
hfenergy: -1326.3284384 hartree
pointgroup: C01 [X(C10H17N4O5P1)]
dipole: -1.3172937 -0.3162495 2.1254699 debye
polarizability: 281.0541726|12.108029|176.9976359|-0.5078838|7.596536|118.0034842 unknown
InChI: InChI=1S/C10H17N4O5P/c1-4-18-20(16,19-5-2)14-10(15)13-9-11-6-8(17-3)7-12-9/h6-7,13-14H,4-5H2,1-3H3
charge 0 multiplicity 1
37 atoms
P  3.330844 0.117468 -0.45079
O  4.170625 0.650158 0.979265
O  3.505889 -1.587497 -0.516626
O  3.782311 0.798189 -1.807359
O  0.387802 -0.834354 -1.055363
O  -5.996031 0.261189 0.131849
N  1.76894 0.526966 0.261862
N  -0.523492 0.925846 0.258688
N  -2.35601 -0.605486 0.049644
N  -2.681278 1.787113 0.394419
C  5.619157 0.999211 0.859654
C  2.806667 -2.480872 0.461896
C  0.517074 0.116336 -0.247817
C  5.804084 2.454691 0.423502
C  3.383393 -3.873874 0.22963
C  -1.904675 0.664111 0.213747
C  -4.604933 0.321285 0.158717
C  -3.711107 -0.769103 0.010803
C  -4.022347 1.601359 0.372576
C  -6.606671 -1.057111 -0.097126
H  1.828107 1.10748 1.104215
H  6.009464 0.816639 1.874857
H  6.112525 0.303128 0.154896
H  3.000194 -2.120224 1.490746
H  1.725638 -2.44102 0.240573
H  5.285501 3.13915 1.117374
H  5.409782 2.607031 -0.595368
H  6.880169 2.71243 0.425482
H  3.214656 -4.187819 -0.81388
H  4.467701 -3.893264 0.431916
H  2.885119 -4.59975 0.89907
H  -0.307946 1.887006 0.536761
H  -4.059419 -1.797271 -0.129708
H  -4.660516 2.478034 0.522494
H  -6.293426 -1.475873 -1.072435
H  -7.689885 -0.871616 -0.099978
H  -6.348009 -1.762186 0.715914
