program: Gaussian 09
title: 000213514
version: EM64L-G09RevD.01
frameworkgroup: C1[X(C14H18ClNO2)]
method: RPBEPBE
basis: SDD
operation: Freq
keyword: #p
keyword: freq=noraman
keyword: PBEPBE/SDD
title: #p freq=noraman PBEPBE/SDD
converged: YES YES NO NO
title: Mulliken charges:
elementType: Cl O O N C C C C C C C C C C C C C C H H H H H H H H H H H H H H H H H H
charge: -0.060827 -0.409136 -0.237852 -0.152460 -0.413697 -0.398008 -0.390367 -0.382713 -0.404267 0.529276 -0.336432 -0.344203 0.540806 -0.332511 -0.370872 -0.488878 -0.693351 0.179303 0.184973 0.233671 0.240624 0.196469 0.195168 0.211119 0.215991 0.195485 0.219947 0.189355 0.247536 0.248947 0.283404 0.233806 0.229881 0.242830 0.221844 0.375141
chargesum: 0.00000
title: Mulliken charges with hydrogens summed into heavy atoms:
elementType: Cl O O N C C C C C C C C C C C C C C
charge: -0.060827 -0.033995 -0.237852 -0.152460 0.004947 0.039085 0.015920 0.028763 0.005035 0.529276 -0.336432 -0.096666 0.540806 -0.083564 -0.087469 -0.255072 0.001203 0.179303
polarizability: 2.50588960e+02 -4.48266534e+00 1.68341782e+02 -4.56917397e+00 -3.70640260e+00 1.21112839e+02
1716.lowfreq: -9.9070 -0.2869 -0.0026 -0.0021 -0.0019 7.7531 22.1598 35.8127 45.1661
frequency: 20.5225 35.5105 45.0620 59.6924 78.7253 106.5799 123.9676 171.2691 182.2450 205.2336 214.3426 240.3934 251.9770 265.1208 287.1749 319.4631 375.9648 382.7629 393.5404 426.3101 439.8634 450.1614 488.9022 499.2603 550.3621 597.0977 612.2725 627.5587 660.9738 678.9734 719.2584 744.2814 796.7134 805.2645 817.6452 835.8339 847.1210 853.3208 897.8906 913.8578 925.3592 943.9411 955.3761 995.1116 1013.2787 1032.9623 1038.5590 1061.3091 1072.5573 1081.5646 1097.0408 1123.5582 1131.3462 1150.7005 1154.2984 1198.6865 1219.4158 1235.5480 1241.0471 1261.2058 1264.8548 1274.3142 1288.6023 1332.3604 1338.9168 1341.9887 1346.9121 1353.1333 1358.7133 1371.1910 1378.2946 1389.7170 1410.0267 1451.6745 1460.6248 1464.6409 1466.9711 1468.7108 1475.2321 1475.8274 1496.6223 1547.9236 1614.9114 1657.8948 2866.9903 2881.8090 2966.8202 2986.8497 2992.0993 2992.5768 3036.0372 3045.9840 3046.5839 3051.2706 3059.4011 3090.4942 3093.1074 3105.1343 3126.8050 3150.5458 3160.1960 3504.1160
redmass: 5.6555 5.2289 5.7482 4.5932 4.3903 4.9610 4.2043 4.5552 4.1549 3.5705 1.0677 4.2999 2.7420 2.6821 2.9707 4.8320 2.0815 4.9102 4.6350 4.3949 2.8934 3.5019 2.2713 4.3435 2.5712 2.8389 2.9460 1.9018 4.9862 2.8259 4.0792 5.1169 2.6068 1.4826 1.7728 2.5572 2.7997 1.5358 1.4585 2.3967 3.3262 1.4007 1.3161 2.3577 2.8517 2.4407 2.5270 1.9591 1.5945 1.4819 2.2972 3.0994 2.1417 1.3159 1.3974 1.7148 1.9317 1.4958 1.5871 1.3187 1.3089 1.1695 1.9344 1.2976 1.6244 1.7488 1.6598 1.5468 1.5335 2.3829 1.6781 1.2034 3.2442 1.0902 1.0892 1.1137 1.0889 1.0542 1.0878 1.0782 2.8211 6.4341 6.9345 8.1046 1.0702 1.0724 1.0637 1.0609 1.0607 1.0355 1.0962 1.0936 1.0852 1.0994 1.1031 1.1000 1.0889 1.1007 1.0889 1.0923 1.0942 1.0638
irintensity: 0.0293 0.7980 2.6826 0.3904 0.4329 0.8214 0.1370 1.9190 0.5726 1.1928 0.4476 2.2050 2.8063 2.5685 0.4925 1.7035 5.3772 3.3342 2.5006 7.5593 4.9535 6.5541 14.9708 2.0059 9.6766 43.7723 27.1390 98.8601 36.7860 17.9370 6.7713 12.9312 13.1527 0.8631 28.8732 5.0907 8.2489 31.8662 14.4457 6.0252 28.9113 2.6836 3.4811 18.9612 24.6516 259.8040 25.7567 12.4278 16.9314 12.3471 46.6905 9.0849 23.4438 7.3371 8.2059 17.2430 23.3992 2.3740 131.1592 1.4237 13.8106 13.1578 5.1453 0.4463 15.7735 13.5443 22.7017 9.6369 2.1122 28.4548 34.7546 19.1597 9.5059 7.9407 17.8096 48.8213 13.9132 9.4959 6.6074 17.7892 170.6791 7.6691 42.0670 189.3516 70.9096 106.6801 43.4027 38.3338 37.9988 26.4170 75.0927 35.5644 8.3115 8.1192 86.3008 39.9595 7.2585 16.1164 14.9896 0.1929 12.6056 22.0015
temp: 298.150 k
press: 1.00000 atm
elementType: 17 8 8 7 6 6 6 6 6 6 6 6 6 6 6 6 6 6 1 1 1 1 1 1 1 1 1 1 1 1 1 1 1 1 1 1
symmnumber: 1
zpe: 772442.0 jmol-1
zpe.correction: 0.294208 hartree
zpe.thermalcorrener: 0.311833 hartree
zpe.thermalcorrenthalpy: 0.312777 hartree
zpe.thermalcorrgfe: 0.247054 hartree
zpe.sumelectzpe: -1208.198232 hartree
zpe.sumelectthermal: -1208.180606 hartree
zpe.sumelectthermalent: -1208.179662 hartree
zpe.sumelectthermalfe: -1208.245386 hartree
dipole: -1.4424 -3.2185 0.9252
dipole: 3.6463
quadrupole: -102.4201 -115.7809 -110.8843
quadrupole: -3.1297 -0.1118 2.6711
quadrupole: 7.2750 -6.0858 -1.1892 -3.1297 -0.1118 2.6711
hfenergy: -1208.4924395 hartree
pointgroup: C01 [X(C14H18Cl1N1O2)]
dipole: -0.5816155 1.1008435 -0.712647 debye
polarizability: 250.2917176|7.3181298|162.7713206|4.4331238|-15.8208739|126.9805428 unknown
InChI: InChI=1S/C14H18ClNO2/c1-10(14(17)18)11-5-6-13(12(15)9-11)16-7-3-2-4-8-16/h5-6,9-10,17H,2-4,7-8H2,1H3
charge 0 multiplicity 1
36 atoms
Cl -0.7626 -2.261335 1.296787
O  4.591981 0.0322 -1.764054
O  4.397761 -1.524472 -0.053637
N  -2.316329 0.117856 -0.064349
C  -3.140392 1.345405 -0.138445
C  -2.896374 -1.01378 -0.841382
C  -4.571608 1.062883 0.370215
C  -4.314395 -1.355148 -0.344451
C  -5.223447 -0.106332 -0.401918
C  -0.908908 0.256635 -0.007004
C  -0.051744 -0.74612 0.544406
C  -0.251827 1.442357 -0.457026
C  1.966041 0.578536 0.149341
C  3.485709 0.765352 0.262272
C  1.342461 -0.609304 0.610579
C  1.145212 1.602767 -0.374886
C  3.963101 0.809905 1.736938
C  4.191224 -0.366821 -0.480865
H  -3.195463 1.734977 -1.185826
H  -2.671302 2.125345 0.486926
H  -2.236852 -1.89012 -0.756514
H  -2.942391 -0.728523 -1.921033
H  -5.177479 1.984138 0.269929
H  -4.519336 0.810677 1.446812
H  -4.24637 -1.726383 0.695714
H  -4.731462 -2.169735 -0.967075
H  -6.223044 -0.331982 0.014446
H  -5.373738 0.189571 -1.461294
H  -0.853045 2.239883 -0.903694
H  3.755124 1.707166 -0.245762
H  1.943969 -1.420305 1.034395
H  1.601731 2.52922 -0.742944
H  3.429353 1.609456 2.278608
H  3.762659 -0.15063 2.240782
H  5.048765 1.006476 1.796895
H  5.006116 -0.743315 -2.233087
