program: Gaussian 09
title: 000213538
version: EM64L-G09RevD.01
frameworkgroup: C1[X(C21H22F3N3O)]
method: RPBEPBE
basis: SDD
operation: Freq
keyword: #p
keyword: freq=noraman
keyword: PBEPBE/SDD
title: #p freq=noraman PBEPBE/SDD
converged: YES YES NO NO
title: Mulliken charges:
elementType: F F F O N N N C C C C C C C C C C C C C C C C C C C C C H H H H H H H H H H H H H H H H H H H H H H
charge: -0.162426 -0.167094 -0.170879 -0.256357 -0.081731 -0.303759 -0.095294 -0.364411 -0.371370 -0.391037 -0.386010 -0.399164 -0.365477 -0.285425 0.123131 0.020364 0.293087 0.470021 -0.342086 -0.297243 -0.465072 -0.240900 -0.224596 -0.389329 0.324592 -0.184278 -0.407434 0.240659 0.177790 0.206061 0.213760 0.169377 0.193069 0.206162 0.205264 0.193941 0.216072 0.189832 0.202506 0.220773 0.240721 0.225019 0.258382 0.244725 0.261613 0.231215 0.229979 0.287876 0.237351 0.268027
chargesum: 0.00000
title: Mulliken charges with hydrogens summed into heavy atoms:
elementType: F F F O N N N C C C C C C C C C C C C C C C C C C C C C
charge: -0.162426 -0.167094 -0.170879 -0.256357 -0.081731 -0.303759 -0.095294 0.019440 0.011767 0.008194 0.013196 0.006740 0.057801 0.180315 0.123131 0.020364 0.293087 0.470021 -0.083703 -0.052518 -0.203458 -0.009686 0.005383 -0.101453 0.324592 0.053073 -0.139406 0.240659
polarizability: 3.37309518e+02 1.29241559e+01 3.19007686e+02 5.20719081e+00 9.23044257e+00 1.47057738e+02
1716.lowfreq: -18.3500 -5.1409 -0.0012 -0.0006 0.0004 2.8553 5.6676 15.7811 17.8062
frequency: -18.2954 15.5023 17.3857 27.4129 36.2448 57.0001 61.7097 80.0775 96.0681 126.1416 129.7850 143.3321 168.9914 188.1131 200.7293 221.6254 238.2717 244.1548 271.8048 282.7575 303.6042 314.8488 335.2886 340.0911 376.1428 383.9777 400.3159 418.2629 425.5419 432.5452 451.0926 453.3942 481.3901 518.5405 540.2656 559.5337 571.0215 588.7885 607.9352 618.2167 633.4980 642.5986 667.5227 693.0242 724.3052 747.5386 755.2586 761.0512 762.6839 797.1714 805.9468 807.8553 823.9232 852.6256 857.0187 858.8273 879.3125 905.5887 919.8902 922.6715 949.1385 950.0482 956.9544 980.1066 983.6712 985.9915 991.6981 996.7657 1007.0150 1015.4521 1039.7950 1043.6221 1050.8024 1074.4725 1087.5770 1100.2874 1103.1516 1107.3921 1113.6972 1125.5679 1148.1216 1149.8472 1160.9873 1170.0724 1177.2928 1182.4861 1204.2478 1246.8258 1259.0060 1264.9517 1268.9382 1279.1257 1282.4051 1292.2984 1314.2531 1316.1337 1331.1241 1341.5846 1347.2776 1352.6602 1361.8956 1369.2482 1382.6630 1395.4560 1399.4777 1412.2369 1426.9941 1449.0096 1450.2152 1460.2668 1462.2973 1467.6355 1470.0165 1477.9957 1479.2657 1483.7375 1491.8980 1508.3713 1583.6757 1599.6981 1619.3443 1625.9614 2824.6207 2834.6487 2895.0557 2967.5616 2986.4222 2986.8237 3006.0547 3024.6549 3029.0633 3036.5321 3043.5376 3047.2022 3056.2290 3081.1246 3137.2847 3150.5986 3153.0173 3171.4126 3180.0664 3182.1421 3191.0927 3193.1585
redmass: 16.5214 3.2170 6.6889 4.4496 5.2470 4.8862 5.5347 4.9617 4.1452 5.5973 2.2321 5.7591 4.3626 4.1427 4.9379 5.5122 2.0869 4.8034 3.3712 6.7973 6.7453 2.9821 3.9369 6.2927 2.4558 4.0216 4.4843 3.6689 3.3404 4.9207 3.2106 3.1018 4.9904 9.4086 2.3872 4.7587 6.6700 3.6758 11.6934 6.6714 6.1630 6.8183 7.4438 2.1840 7.6749 3.0780 4.3290 1.7273 4.0490 1.3513 1.4540 1.3463 5.7503 1.5278 1.3939 2.4293 1.5445 2.4835 4.2381 1.5439 1.5690 4.3600 1.3102 8.2228 3.7918 1.4988 1.3812 2.4729 5.6138 2.4229 5.4690 1.8880 1.9540 3.9704 2.8004 1.6503 1.7084 2.5795 1.9584 2.1775 1.6539 1.3657 2.2124 1.2399 1.1887 1.1214 2.4122 1.6925 1.2427 1.1857 2.9177 1.6708 1.2110 1.4082 1.3613 1.4147 1.2918 1.4236 1.5254 1.5159 2.3647 1.6747 2.7637 2.1069 4.6650 4.9872 3.0049 3.9608 1.0948 1.0880 1.0845 1.0870 1.1143 1.1070 3.3783 1.1002 3.0301 5.4927 6.8255 6.9766 6.4441 7.4325 1.0715 1.0699 1.0697 1.0627 1.0613 1.0615 1.0582 1.0875 1.0898 1.0941 1.0898 1.1034 1.1037 1.1075 1.0864 1.0886 1.0906 1.0974 1.0938 1.0963 1.0944 1.0941
irintensity: 0.0357 0.0153 0.3230 0.4896 0.9802 0.5989 0.6234 1.2464 2.1778 0.2452 1.8630 0.4401 0.4608 2.1175 2.7510 0.7220 0.5114 1.4529 0.4374 0.6732 0.4088 8.0408 1.3332 13.3451 3.5577 2.2160 1.1536 11.2170 13.1402 0.5865 0.9082 1.3420 1.6429 0.2153 1.8870 4.3558 2.3860 0.7175 19.2128 4.1211 11.9382 5.9915 21.6324 26.6667 57.4597 29.9695 11.2389 44.3298 10.7572 4.8656 67.9247 1.4238 7.0150 3.8765 0.1983 9.0579 26.7648 12.3343 103.6223 17.2139 3.0419 9.4839 4.3292 207.5128 23.4206 5.4420 2.1334 21.1695 140.2006 18.2305 149.0081 16.2723 12.4967 39.9273 4.5295 0.2929 16.8460 44.3635 20.5009 3.1637 48.9936 7.0260 36.4772 2.2373 7.7610 1.5595 13.6446 8.6980 2.4032 4.9043 314.3767 30.8118 7.7339 8.6238 124.8145 5.1584 1.5163 0.7270 5.0367 10.2808 14.2276 31.1390 122.2433 16.0765 3.5059 15.9012 118.4092 96.6236 8.5044 15.1800 2.7694 4.5901 52.4547 16.3766 1.0057 23.9238 56.5488 563.4264 4.6491 29.6629 126.6165 35.0722 44.5744 159.2743 81.1252 40.0691 34.1596 28.3752 16.9098 57.6808 62.8036 32.5509 17.2396 19.1033 96.9650 38.8100 2.8746 11.8314 11.0952 21.3620 0.9101 6.5358 3.5301 0.4985
temp: 298.150 k
press: 1.00000 atm
elementType: 9 9 9 8 7 7 7 6 6 6 6 6 6 6 6 6 6 6 6 6 6 6 6 6 6 6 6 6 1 1 1 1 1 1 1 1 1 1 1 1 1 1 1 1 1 1 1 1 1 1
symmnumber: 1
zpe: 1033900.9 jmol-1
zpe.correction: 0.393792 hartree
zpe.thermalcorrener: 0.417689 hartree
zpe.thermalcorrenthalpy: 0.418633 hartree
zpe.thermalcorrgfe: 0.337490 hartree
zpe.sumelectzpe: -1350.376846 hartree
zpe.sumelectthermal: -1350.352950 hartree
zpe.sumelectthermalent: -1350.352005 hartree
zpe.sumelectthermalfe: -1350.433148 hartree
dipole: 5.0740 0.5185 -1.2893
dipole: 5.2609
quadrupole: -172.0077 -147.3780 -167.4268
quadrupole: -6.7423 4.0491 3.3887
quadrupole: -9.7369 14.8928 -5.1559 -6.7423 4.0491 3.3887
hfenergy: -1350.7706385 hartree
pointgroup: C01 [X(C21H22F3N3O1)]
dipole: -1.9885945 -0.1977093 -0.5388961 debye
polarizability: 337.1878916|13.2920072|319.685345|-2.395385|-1.7773916|146.5017059 unknown
InChI: InChI=1S/C21H22F3N3O/c22-21(23,24)16-7-6-8-17(15-16)27-19-10-3-2-9-18(19)20(25-27)28-14-13-26-11-4-1-5-12-26/h2-3,6-10,15H,1,4-5,11-14H2
charge 0 multiplicity 1
50 atoms
F  6.489386 2.710669 0.349115
F  5.925363 1.067044 1.807798
F  6.362491 0.555339 -0.350276
O  -2.131797 -1.561836 0.128952
N  -5.327715 0.372749 0.28126
N  1.193789 -0.401721 -0.124364
N  -0.20017 -0.148975 0.01009
C  -5.594062 0.849644 -1.101447
C  -6.590233 0.168884 1.038244
C  -6.371495 2.18094 -1.087886
C  -7.400713 1.478716 1.118266
C  -7.689984 2.032819 -0.295743
C  -4.421656 -0.798323 0.318337
C  -2.963077 -0.330094 0.24993
C  -0.779658 -1.366388 0.009083
C  0.177693 -2.437798 -0.139186
C  1.450647 -1.782053 -0.237888
C  2.066501 0.714858 -0.139763
C  0.068399 -3.844551 -0.227644
C  2.631531 -2.531985 -0.472521
C  3.43828 0.580493 0.181107
C  1.244339 -4.588939 -0.433294
C  2.503358 -3.93173 -0.564414
C  1.543905 1.999186 -0.45853
C  4.278388 1.71628 0.132953
C  2.396062 3.117549 -0.488658
C  3.775096 2.99027 -0.205407
C  5.728623 1.52976 0.474648
H  -6.182395 0.085851 -1.677166
H  -4.631337 0.982021 -1.628425
H  -6.332589 -0.179972 2.055572
H  -7.226377 -0.624596 0.562731
H  -6.574588 2.498521 -2.128779
H  -5.739547 2.95749 -0.615543
H  -6.816192 2.221779 1.694353
H  -8.343998 1.292977 1.6671
H  -8.215691 3.004095 -0.231194
H  -8.364842 1.334609 -0.833551
H  -4.614265 -1.521253 -0.510764
H  -4.575643 -1.345275 1.266019
H  -2.669116 0.221351 1.160432
H  -2.769494 0.314086 -0.627528
H  -0.909549 -4.328546 -0.146972
H  3.609544 -2.066845 -0.611322
H  3.847351 -0.376945 0.509163
H  1.198025 -5.680305 -0.506812
H  3.401415 -4.531799 -0.748358
H  0.476759 2.090966 -0.67103
H  1.984089 4.099853 -0.740953
H  4.43995 3.857132 -0.239937
