program: Gaussian 09
title: 000213500
version: EM64L-G09RevD.01
frameworkgroup: C1[X(C12H11N2O)]
method: RPBEPBE
basis: SDD
operation: Freq
keyword: #p
keyword: freq=noraman
keyword: PBEPBE/SDD
title: #p freq=noraman PBEPBE/SDD
converged: YES YES NO NO
title: Mulliken charges:
elementType: O N N C C C C C C C C C C C C H H H H H H H H H H H
charge: -0.172936 -0.056590 -0.055168 -0.499322 0.163477 -0.066527 -0.125881 0.066442 -0.189808 -0.172744 -0.137371 -0.240333 -0.167713 -0.134399 -0.348835 0.297062 0.306279 0.305347 0.287775 0.281531 0.280419 0.290010 0.287028 0.271743 0.261419 0.269097
chargesum: 1.00000
title: Mulliken charges with hydrogens summed into heavy atoms:
elementType: O N N C C C C C C C C C C C C
charge: -0.172936 -0.056590 -0.055168 0.104019 0.163477 0.238820 0.161894 0.066442 0.091722 0.107674 0.152640 0.046695 0.104030 0.127020 -0.079739
polarizability: 2.34473743e+02 1.28159176e+01 1.24707560e+02 -5.96251641e+00 1.90443734e+00 7.94635792e+01
1716.lowfreq: -6.7744 0.0003 0.0008 0.0009 2.2935 6.1915 22.5923 45.8449 72.3603
frequency: 22.5058 45.8045 72.3576 84.5550 148.8953 157.2107 239.5772 303.8039 349.8598 386.7585 398.7262 414.1270 454.9288 475.5006 563.4455 575.0246 611.0370 641.9221 671.5077 693.3679 743.1748 756.4593 793.1468 796.8828 830.0835 852.2892 924.1373 938.8210 952.8084 966.6653 973.3237 981.0590 987.3241 1017.1107 1022.1517 1023.2771 1035.0997 1050.3557 1087.4934 1092.0769 1161.8850 1172.0609 1180.3398 1192.1616 1222.3443 1245.6737 1286.2868 1293.2875 1341.7630 1356.0396 1369.0783 1420.5322 1429.2670 1446.3964 1475.7459 1482.2754 1561.1068 1563.4108 1570.0125 1613.8433 1629.3372 3038.4415 3122.3375 3154.6699 3163.4825 3175.3157 3177.7340 3188.4109 3190.2751 3197.9901 3207.8736 3222.2676
redmass: 4.6406 4.2211 4.8743 5.1150 5.7015 5.3350 4.7449 6.6087 2.5219 2.9693 2.6876 3.8848 4.6977 5.7240 5.6357 2.7337 7.3895 6.2928 4.1091 2.2341 2.4712 1.9413 1.6013 3.5993 4.2320 1.2679 1.2893 1.4418 2.1904 6.9727 4.0522 1.4042 1.4909 5.1884 1.3724 1.3722 2.2296 2.3039 1.6661 1.6189 1.4590 1.0854 1.7304 1.3527 1.2003 2.0598 1.5762 1.8961 6.0554 1.7363 2.4103 1.8770 1.1956 2.1594 2.2554 1.8879 5.7912 5.3676 5.8092 9.5189 5.3282 1.0650 1.0991 1.0895 1.0908 1.0955 1.0908 1.1019 1.0916 1.0963 1.1006 1.1002
irintensity: 0.4184 1.7085 2.8352 8.6772 5.2207 13.3064 4.7869 5.9558 0.8138 4.7623 0.9045 1.6213 1.2178 5.1786 18.4818 13.4303 7.2218 0.8093 6.7855 66.6175 21.1905 31.6722 70.0182 2.8582 11.0375 1.4605 0.5087 1.2738 15.7297 7.2385 49.2765 1.8621 1.3302 2.4624 0.2836 0.0258 3.9881 2.0777 6.2288 10.1133 5.1344 1.3900 7.3494 2.9156 5.0298 43.3227 3.2012 191.8264 9.0219 1.8602 5.2348 37.4563 32.3710 1.3239 57.0797 14.9910 0.6504 55.9067 4.1507 111.9648 9.1931 2.7352 1.9087 4.2499 3.6188 1.3639 0.1520 7.4265 0.4464 0.6913 2.0650 2.4286
temp: 298.150 k
press: 1.00000 atm
elementType: 8 7 7 6 6 6 6 6 6 6 6 6 6 6 6 1 1 1 1 1 1 1 1 1 1 1
symmnumber: 1
zpe: 538237.6 jmol-1
zpe.correction: 0.205004 hartree
zpe.thermalcorrener: 0.217202 hartree
zpe.thermalcorrenthalpy: 0.218146 hartree
zpe.thermalcorrgfe: 0.164583 hartree
zpe.sumelectzpe: -647.311497 hartree
zpe.sumelectthermal: -647.299299 hartree
zpe.sumelectthermalent: -647.298355 hartree
zpe.sumelectthermalfe: -647.351918 hartree
dipole: 4.4257 -1.7120 0.3658
dipole: 4.7594
quadrupole: -5.6489 -75.6312 -80.3583
quadrupole: -1.5953 -0.1143 4.9821
quadrupole: 48.2305 -21.7517 -26.4788 -1.5953 -0.1143 4.9821
hfenergy: -647.5165006 hartree
pointgroup: C01[X(C12H11N2O1)]
dipole: -1.7405893 0.6135875 -0.3163706 debye
dipolederiv: -0.9207027 -0.1178757 0.0588292 -0.1937326 -0.6289535 0.1426659 0.2624194 0.1260543 -0.297474 -0.0312198 -0.101487 -0.0016529 0.2742621 -0.1371664 0.0420996 -0.1176931 0.0172014 -0.0728975 -0.170415 -0.0063653 0.0024473 0.1628847 -0.3159347 0.0178452 -0.0829062 0.0301912 -0.1893321 -0.0900364 0.1953973 -0.0187253 0.5155557 -0.1439012 0.0828851 -0.0812878 0.069947 0.1210461 1.7647455 -0.0381317 -0.1282219 -0.3651707 0.7676366 -0.1923266 -0.1245639 -0.2073717 0.2131901 0.459079 -0.0062979 0.2413592 -0.162263 0.0696181 0.0141731 -0.0185132 -0.0356034 0.0826161 0.0861084 0.1335901 -0.1676382 -0.0475454 0.0381211 -0.0765577 0.1216408 0.0345228 0.0689648 -0.702093 -0.0040123 0.0516216 0.0790394 0.0342109 0.0091325 0.0129535 0.0043478 -0.0166194 -0.3165889 0.0581903 -0.2965195 -0.000434 -0.0395907 -0.1272782 -0.2743312 -0.0513618 -0.0327452 -0.05911 -0.0979341 0.2760953 -0.0297223 -0.1165207 0.0609238 0.0798784 0.0207272 0.0301408 0.2224662 0.0937827 0.0091379 0.0447922 0.0182539 -0.0356103 0.1700294 -0.0479523 0.1513555 -0.0890622 0.1201227 -0.0444411 -0.1154644 0.016672 -0.021607 0.0290335 -0.0312382 -0.0244898 0.0978987 -0.1714684 0.0404122 -0.1507116 0.0544016 -0.035321 0.034725 -0.0361371 -0.0882396 0.1893567 0.1003145 -0.0594363 -0.1396411 -0.1433701 0.0407822 0.0336689 0.0231001 -0.048298 -0.2623354 -0.0060824 0.0156489 0.3813282 0.3460868 -0.1567413 -0.0766505 -0.1288074 0.0006112 0.1578926 0.0094782 -0.0192393 -0.0276474 0.1282713 0.0125058 -0.0143779 0.0421008 0.0296551 0.0477178 0.0167515 0.0131485 -0.0726926 0.1122882 -0.0252654 0.0181479 -0.0493441 0.0556596 0.0894914 -0.0244301 -0.0534408 0.0082204 0.1346975 0.010291 -0.0415997 -0.0029913 0.1186771 0.0789625 -0.0476107 0.0435729 -0.0383299 0.1456985 0.0278747 0.0292557 0.0130861 0.1090016 0.107212 -0.0186564 0.0136547 -0.0290672 0.1524868 0.0298088 0.0120118 0.0298947 0.0589212 0.1080552 -0.0120272 -0.0260437 -0.0112993 0.1594907 0.0235517 -0.0237423 0.0207619 0.0513297 0.0434706 -0.0357418 -0.0075862 -0.0287455 0.144294 0.0091475 -0.0044133 0.0056873 0.1215255 0.1229368 -0.0467466 0.0250161 -0.0301758 0.05449 0.0397009 0.0226285 0.0453562 0.1440564 0.0265731 0.0607511 -0.009806 0.0664381 0.047692 0.0304462 -0.0086545 0.0325431 0.1446829 -0.0239683 -0.0287235 0.0274732 -0.0206249 0.1111054 0.0192271 0.0167161 0.0177024 0.1494292 0.0635651 -0.0247873 0.0143342 -0.069253 -0.0100781 0.0576464 0.0256245 0.0575831 0.1192325 unknown
polarizability: 234.4697077|13.9549544|105.1575283|-2.7951263|-22.4440845|99.0176469 unknown
InChI: InChI=1S/C12H11N2O/c15-12(11-6-2-3-7-13-11)10-14-8-4-1-5-9-14/h1-9H,10H2
charge 1 multiplicity 1
26 atoms
O  -0.101837 -1.429122 0.804826
N  -1.891575 0.527954 0.01109
N  2.253951 1.059775 -0.304776
C  -0.455726 0.897363 0.098558
C  0.418341 -0.362564 0.385235
C  -2.520008 0.02688 1.129795
C  -2.548683 0.595147 -1.198389
C  1.877501 -0.176181 0.162944
C  -3.856237 -0.395824 1.062967
C  -3.880964 0.180144 -1.307663
C  -4.550062 -0.322269 -0.164913
C  2.792144 -1.22319 0.437945
C  4.165201 -0.981914 0.213131
C  4.565527 0.28657 -0.266983
C  3.578883 1.277955 -0.50938
H  -0.1177 1.387031 -0.826444
H  -0.30071 1.625753 0.914812
H  -1.935502 -0.009331 2.049239
H  -1.981326 0.988101 -2.04428
H  -4.334795 -0.780694 1.966041
H  -4.381296 0.250676 -2.275948
H  -5.591385 -0.649184 -0.233603
H  2.422702 -2.181588 0.814381
H  4.905979 -1.762738 0.408598
H  5.619336 0.51209 -0.454494
H  3.85694 2.269659 -0.879586
