program: Gaussian 09
title: 000213498
version: EM64L-G09RevD.01
frameworkgroup: C1[X(C12H8BrN3O4S)]
method: RPBEPBE
basis: SDD
operation: Freq
keyword: #p
keyword: freq=noraman
keyword: PBEPBE/SDD
title: #p freq=noraman PBEPBE/SDD
converged: YES YES NO NO
title: Mulliken charges:
elementType: Br S O O O O N N N C C C C C C C C C C C C H H H H H H H H
charge: 0.102111 0.352447 -0.208507 -0.198091 -0.219928 -0.190840 -0.407926 0.047973 0.112318 0.404003 -0.345062 0.277806 -0.305832 -0.269985 -0.303563 -0.213707 -0.122297 0.309773 -0.131911 -0.504736 -0.224018 0.267096 0.295561 0.223117 0.234827 0.252893 0.273658 0.284904 0.207915
chargesum: 0.00000
title: Mulliken charges with hydrogens summed into heavy atoms:
elementType: Br S O O O O N N N C C C C C C C C C C C C
charge: 0.102111 0.352447 -0.208507 -0.198091 -0.219928 -0.190840 -0.123022 0.047973 0.112318 0.404003 -0.077966 0.277806 -0.010271 -0.046868 -0.303563 0.021120 -0.122297 0.309773 0.120982 -0.231077 -0.016102
polarizability: 6.27584471e+02 -1.51636385e+01 2.22974827e+02 6.04055913e-01 3.40954389e+00 7.49771346e+01
1716.lowfreq: -4.3624 -3.2164 -0.7183 0.0016 0.0017 0.0018 16.6368 17.8539 26.3500
frequency: 16.6365 17.5767 26.3455 38.3359 45.9817 63.5772 70.9524 104.3788 113.6199 133.4882 153.7866 183.3193 185.8388 213.3891 228.4362 259.1296 274.3948 349.6501 374.4242 385.8724 421.6880 441.4436 461.3340 497.8734 526.2640 557.8397 562.3142 564.1995 626.7743 635.0637 657.6733 660.6849 677.8219 702.2307 706.9857 719.1033 725.2053 766.7981 794.2431 810.3943 827.4250 840.6082 845.0590 902.7214 907.5559 909.1004 912.0986 924.1885 978.3727 1026.3068 1064.9310 1090.8390 1105.0084 1129.1081 1173.3063 1207.3017 1209.9360 1225.7168 1240.6482 1273.6010 1313.4990 1328.8268 1339.8675 1344.9743 1374.8594 1451.8563 1459.1499 1491.7716 1519.3674 1521.5822 1554.9041 1617.4554 1619.3017 2966.2642 3102.1975 3154.4455 3188.0471 3226.7740 3237.3214 3259.6423 3372.8632
redmass: 12.7770 6.6671 10.5796 10.4238 8.1885 11.0501 9.0177 8.0390 7.5336 14.2586 7.0858 7.5838 9.6338 9.3845 3.7769 4.4686 7.5039 8.9565 4.2981 9.9346 6.8953 8.0051 7.2765 9.2557 3.7372 3.0292 5.3792 6.0889 1.3144 8.8864 3.9683 6.7883 8.4689 6.5083 7.7317 1.1652 11.0097 7.3433 1.2819 5.5078 1.3846 5.9360 1.4786 1.3995 9.7214 1.5331 1.3786 6.2256 5.5554 1.2576 1.7457 1.2301 3.4368 4.3246 2.3581 3.6782 2.7790 2.3309 1.8723 3.8671 2.2960 2.0571 2.3742 4.2541 2.6688 7.1460 7.1867 1.9815 5.8759 5.1120 5.2528 7.8586 6.8926 1.0863 1.0869 1.0926 1.0952 1.0962 1.1001 1.1030 1.0748
irintensity: 0.6310 0.0327 0.1634 2.4829 1.5207 1.0597 1.2191 3.1414 4.5778 2.3684 0.1296 0.1308 1.3299 15.5193 11.5925 13.3647 1.7979 1.0433 2.5148 0.5602 3.4248 0.8055 2.2466 0.8168 3.2041 2.2878 0.5223 15.3337 52.8590 5.7395 0.1165 3.6621 10.9549 15.9593 31.1037 126.8212 24.6176 11.5039 37.0109 86.3495 8.4652 15.9456 30.8709 19.6492 6.8854 39.6211 1.6246 0.1568 35.9980 32.9265 15.5879 10.3236 772.9473 40.7274 157.2135 84.8502 420.6159 369.0095 416.8442 137.1117 17.2571 47.7213 45.5935 44.9239 41.4726 318.1714 29.4688 724.8489 41.5857 57.7125 2.9803 34.7945 140.9236 52.9622 9.0514 12.5661 5.8957 0.9342 0.7299 5.2195 0.6669
temp: 298.150 k
press: 1.00000 atm
elementType: 35 16 8 8 8 8 7 7 7 6 6 6 6 6 6 6 6 6 6 6 6 1 1 1 1 1 1 1 1
symmnumber: 1
zpe: 484450.9 jmol-1
zpe.correction: 0.184518 hartree
zpe.thermalcorrener: 0.204219 hartree
zpe.thermalcorrenthalpy: 0.205163 hartree
zpe.thermalcorrgfe: 0.130934 hartree
zpe.sumelectzpe: -1337.078503 hartree
zpe.sumelectthermal: -1337.058802 hartree
zpe.sumelectthermalent: -1337.057857 hartree
zpe.sumelectthermalfe: -1337.132086 hartree
dipole: 6.9190 11.1455 -0.2007
dipole: 13.1200
quadrupole: -141.8579 -126.6917 -139.3285
quadrupole: -4.1690 2.8153 0.5145
quadrupole: -5.8985 9.2676 -3.3691 -4.1690 2.8153 0.5145
hfenergy: -1337.2630206 hartree
pointgroup: C01 [X(C12H8Br1N3O4S1)]
dipole: 2.694574 4.3985574 -0.1907964 debye
polarizability: 627.7207021|-12.4494408|222.8631197|5.1853322|-1.1330501|74.9526104 unknown
InChI: InChI=1S/C12H8BrN3O4S/c13-8(6-9-3-4-11(20-9)16(18)19)7-14-15-12(17)10-2-1-5-21-10/h1-7,15H
charge 0 multiplicity 1
29 atoms
Br -1.227907 -1.731301 0.172753
S  6.709756 -1.160013 -0.165101
O  -3.914412 -0.167628 -0.003076
O  3.787572 -2.046681 0.029278
O  -7.474275 -0.579935 0.022147
O  -5.782278 -2.135729 0.179083
N  2.841131 0.112662 0.002364
N  -6.219362 -0.924975 0.060534
N  1.555892 -0.355498 0.039858
C  -3.228246 1.061973 -0.119028
C  -4.174623 2.10513 -0.222363
C  -5.275796 0.148762 -0.038563
C  -5.47459 1.522422 -0.171061
C  -1.798504 1.128546 -0.120796
C  5.254013 -0.13179 0.12194
C  5.619268 1.18686 0.404693
C  -0.822685 0.150477 -0.018582
C  3.934322 -0.79824 0.054113
C  7.038665 1.407934 0.388363
C  7.761193 0.257595 0.095603
C  0.58119 0.530526 -0.053481
H  -3.937536 3.162515 -0.322748
H  -6.439943 2.018373 -0.222308
H  -1.427662 2.158655 -0.223443
H  4.907746 1.980132 0.653823
H  7.504976 2.374437 0.591432
H  8.840521 0.13658 0.018816
H  3.039224 1.1201 -0.10115
H  0.771448 1.618009 -0.1662
