program: Gaussian 09
title: 000213518
version: EM64L-G09RevD.01
frameworkgroup: C1[X(C10H17N4O4P)]
method: RPBEPBE
basis: SDD
operation: Freq
keyword: #p
keyword: freq=noraman
keyword: PBEPBE/SDD
title: #p freq=noraman PBEPBE/SDD
converged: YES YES NO NO
title: Mulliken charges:
elementType: P O O O O N N N N C C C C C C C C C C H H H H H H H H H H H H H H H H H
charge: 1.379790 -0.530513 -0.263269 -0.587613 -0.221710 -0.556557 -0.008623 0.074095 -0.963799 0.174427 -0.024518 -0.458410 0.236455 -0.219276 -0.371026 -0.684534 -0.007537 -0.662548 -0.530440 0.228411 0.229974 0.229410 0.250499 0.258516 0.234877 0.222465 0.230862 0.375081 0.365785 0.215524 0.209624 0.231928 0.227208 0.231766 0.231533 0.252145
chargesum: 0.00000
title: Mulliken charges with hydrogens summed into heavy atoms:
elementType: P O O O O N N N N C C C C C C C C C C
charge: 1.379790 -0.530513 -0.263269 -0.587613 -0.221710 -0.556557 -0.008623 0.074095 -0.222933 0.174427 -0.024518 -0.000026 0.236455 0.260634 -0.112511 0.003669 0.207987 0.006211 0.185004
polarizability: 2.22037989e+02 -2.02795505e+00 1.76269169e+02 8.26223063e+00 -4.56418072e+00 1.31571703e+02
1716.lowfreq: -12.8153 -6.0206 -0.0021 -0.0020 -0.0017 3.2498 16.7813 23.3324 30.1332
frequency: 15.9144 23.2121 30.0591 41.8977 48.0665 60.5614 90.2726 105.0925 112.2357 125.4098 154.4027 161.6878 176.3120 191.3808 209.3619 225.8666 234.2205 245.0666 256.3681 266.1319 285.3986 305.3301 318.6700 329.5082 362.4090 403.2818 406.5901 447.9671 457.3273 466.6549 507.5977 526.7254 541.8134 593.4984 640.0807 661.6293 709.4926 730.0738 792.4534 803.4429 806.6594 829.4675 872.9525 885.7466 897.6880 954.8919 961.3194 972.0071 980.3644 987.9865 1027.1802 1047.3861 1061.3378 1065.7388 1108.0037 1112.6462 1141.9545 1145.9484 1159.0050 1179.7210 1239.4342 1253.7703 1263.5271 1283.6666 1289.2841 1312.9691 1342.9637 1367.9653 1383.7688 1387.3016 1395.2816 1418.2633 1442.1223 1456.6036 1459.2073 1468.3582 1470.2451 1477.2095 1479.7740 1485.9356 1496.8692 1518.4347 1533.8344 1560.5095 1626.2467 2971.8900 2989.1641 2992.5140 2996.3643 2996.8282 3015.7871 3060.0554 3066.0274 3074.9230 3088.5372 3089.2945 3101.2855 3106.8625 3136.3276 3152.4218 3545.0371 3692.5283
redmass: 2.9858 5.3156 3.3293 4.7163 2.9548 2.4792 5.9997 4.4881 3.7496 3.9703 5.4458 3.4621 2.8102 2.5194 1.7321 1.4869 1.7006 1.8138 1.9202 3.4019 4.4966 3.1284 2.4508 2.5227 2.6358 5.3311 5.0089 3.1270 4.1967 4.2109 3.0277 4.8397 3.3314 4.6025 7.0862 4.9359 6.0317 4.6907 1.3224 6.0659 1.0863 5.5996 4.6997 4.0125 1.5414 3.9735 5.0746 1.6868 2.2187 2.1337 2.7042 2.2349 3.9231 2.1793 2.2675 1.2578 1.4538 1.9650 2.3473 5.4461 1.8401 1.1395 1.8735 5.3352 2.7875 1.5765 3.2337 1.2620 1.2384 1.3783 1.2618 1.9285 1.3984 1.1098 1.0407 1.0502 1.0618 1.0460 1.0479 1.0938 1.0834 7.5243 5.0908 1.0996 7.3869 1.0322 1.0345 1.0369 1.0884 1.0571 1.0594 1.1086 1.1047 1.1018 1.1001 1.0981 1.1028 1.1024 1.1005 1.0920 1.0446 1.1024
irintensity: 0.4615 1.7298 0.0743 2.7997 0.4493 3.6655 1.4433 1.9696 4.8879 8.4656 3.2019 8.3951 7.4687 0.3780 1.4981 5.0832 1.6492 4.8733 1.2825 13.1305 1.5160 2.8422 0.5380 8.6420 15.3379 5.5965 27.2768 46.3901 20.1681 3.5287 100.6949 36.7118 199.1036 19.5407 20.9782 60.5040 22.5924 16.4078 3.9078 6.7217 2.6285 150.4979 14.2916 146.0661 5.9713 46.0143 65.4034 108.1326 22.0793 68.8236 59.7975 26.2236 48.4506 58.7563 12.0258 0.0117 5.4818 65.1280 93.7336 109.7622 18.0958 6.5687 109.1137 65.8321 57.4193 28.2258 165.5397 18.3738 0.6710 83.3061 24.8684 188.9072 58.4790 5.4919 12.7749 16.1637 15.3697 7.7493 6.2788 12.2315 11.4321 46.3849 33.9000 82.0141 255.1219 56.1661 33.1876 17.9776 32.4345 25.8561 15.2916 5.4951 34.1491 0.2915 32.4835 31.1627 32.2149 35.2570 20.3222 18.3398 75.5374 54.7101
temp: 298.150 k
press: 1.00000 atm
elementType: 15 8 8 8 8 7 7 7 7 6 6 6 6 6 6 6 6 6 6 1 1 1 1 1 1 1 1 1 1 1 1 1 1 1 1 1
symmnumber: 1
zpe: 728231.9 jmol-1
zpe.correction: 0.277369 hartree
zpe.thermalcorrener: 0.299449 hartree
zpe.thermalcorrenthalpy: 0.300393 hartree
zpe.thermalcorrgfe: 0.223530 hartree
zpe.sumelectzpe: -1250.898565 hartree
zpe.sumelectthermal: -1250.876485 hartree
zpe.sumelectthermalent: -1250.875541 hartree
zpe.sumelectthermalfe: -1250.952404 hartree
dipole: -1.9146 1.2448 -1.0877
dipole: 2.5295
quadrupole: -79.6726 -111.7358 -138.3848
quadrupole: 1.2388 3.2855 8.7224
quadrupole: 30.2585 -1.8047 -28.4537 1.2388 3.2855 8.7224
hfenergy: -1251.175934 hartree
pointgroup: C01 [X(C10H17N4O4P1)]
dipole: 0.6921299 -0.5415453 -0.4669883 debye
polarizability: 219.6584337|-4.1283035|176.893105|-15.767159|3.2213222|133.3273225 unknown
InChI: InChI=1S/C10H17N4O4P/c1-4-8-9(17-3)6-12-10(13-8)14(7-15)19(11,16)18-5-2/h6-7H,4-5,11H2,1-3H3
charge 0 multiplicity 1
36 atoms
P  -2.578985 0.497677 -0.528482
O  -3.433764 -0.750898 0.308989
O  3.903347 -0.525061 -0.716528
O  -2.012679 0.148258 -1.972521
O  -0.632772 2.011435 2.614534
N  -1.247873 1.06957 0.540609
N  0.357363 -0.646592 0.152954
N  0.976976 1.692559 -0.045984
N  -3.787516 1.692503 -0.308531
C  1.61919 -1.041603 -0.172852
C  0.09904 0.692169 0.200925
C  1.922065 -2.519778 -0.228301
C  2.628027 -0.054162 -0.415153
C  -2.892108 -2.145619 0.231506
C  2.253526 1.308772 -0.340299
C  2.551734 -3.027489 1.098636
C  -1.507385 1.731784 1.763191
C  -3.777082 -2.989947 1.14227
C  4.948509 0.472514 -0.999305
H  0.97619 -3.053841 -0.423708
H  2.620391 -2.722013 -1.059913
H  -2.938798 -2.479907 -0.821622
H  -1.835567 -2.133906 0.558005
H  2.964274 2.119712 -0.526453
H  3.509527 -2.516776 1.300074
H  2.747543 -4.11281 1.037152
H  1.871892 -2.84517 1.949441
H  -4.736872 1.389262 -0.094622
H  -3.663629 2.627651 -0.69237
H  -2.584438 1.970242 1.87779
H  -3.43822 -4.042436 1.120354
H  -3.725437 -2.62775 2.183057
H  -4.828796 -2.956399 0.80972
H  5.122956 1.123652 -0.122025
H  4.681453 1.087749 -1.87917
H  5.851019 -0.116852 -1.213768
