program: Gaussian 09
title: 000213564
version: EM64L-G09RevD.01
frameworkgroup: C1[X(C23H24ClN3O3S)]
method: RPBEPBE
basis: SDD
operation: Freq
keyword: #p
keyword: freq=noraman
keyword: PBEPBE/SDD
title: #p freq=noraman PBEPBE/SDD
converged: YES YES NO NO
title: Mulliken charges:
elementType: Cl S O O O N N N C C C C C C C C C C C C C C C C C C C C C C C H H H H H H H H H H H H H H H H H H H H H H H H
charge: -0.065997 0.223751 -0.236063 -0.218666 -0.203140 -0.099666 -0.214777 -0.295464 0.194929 -0.445637 -0.436720 -0.378935 -0.391288 -0.324785 0.177634 -0.441964 0.221395 -0.402484 -0.607616 0.532044 0.499391 -0.382549 -0.350665 -0.270502 -0.335038 -0.254262 -0.268744 -0.118844 -0.239475 -0.273755 -0.253542 0.211853 0.236845 0.244813 0.210967 0.209451 0.231416 0.226530 0.234365 0.196131 0.228714 0.207456 0.244560 0.211351 0.247627 0.254192 0.253642 0.263796 0.274757 0.244191 0.252949 0.249103 0.231775 0.260256 0.234693
chargesum: 0.00000
title: Mulliken charges with hydrogens summed into heavy atoms:
elementType: Cl S O O O N N N C C C C C C C C C C C C C C C C C C C C C C C
charge: -0.065997 0.223751 -0.236063 -0.218666 -0.203140 -0.099666 -0.214777 -0.295464 0.194929 0.003061 0.019061 0.061931 0.069607 0.100060 0.177634 0.010052 0.221395 0.056494 0.164015 0.532044 0.499391 -0.382549 -0.350665 0.004255 -0.090847 -0.001313 -0.019641 -0.118844 -0.007700 -0.013499 -0.018849
polarizability: 3.70994101e+02 8.05809401e+01 2.96167062e+02 -3.26578171e+01 7.27076593e+00 2.45305975e+02
1716.lowfreq: -17.4337 -6.0905 -3.3999 -0.0014 0.0008 0.0016 5.2112 9.6691 16.2703
frequency: -10.7867 9.2461 15.8523 34.0849 38.1321 41.8591 50.3098 64.4587 74.3022 90.6491 113.6535 121.7480 145.3149 155.4349 168.6488 205.1055 215.8555 227.2132 241.2036 258.6559 260.9876 266.9307 278.5315 288.4011 301.5966 312.5505 333.1847 346.4132 357.4981 361.0437 374.7932 379.1307 400.4770 412.7761 428.6291 440.1810 472.4956 478.2346 484.0917 516.8439 532.9629 555.2793 558.9180 569.8850 586.5253 592.6379 619.6656 653.1834 665.7287 679.7260 683.9162 701.6686 710.8396 722.4825 723.2908 727.8901 754.5470 765.8241 800.0485 810.1629 815.7906 844.5486 851.2614 854.4016 869.4539 900.3274 909.5175 931.7950 932.2451 937.2900 959.5577 974.1452 974.4618 992.6672 1014.6351 1021.9135 1029.0708 1035.4445 1038.6888 1044.7257 1046.3858 1080.5527 1083.5245 1085.5393 1098.8469 1121.0864 1124.4709 1125.8465 1130.8984 1140.9885 1156.2685 1167.8327 1174.4587 1183.9467 1213.9479 1227.4349 1242.0490 1243.3024 1248.0011 1266.7163 1280.1267 1289.3893 1296.9129 1307.0797 1314.1469 1315.8601 1333.9493 1341.1340 1348.3797 1357.5335 1361.4623 1369.8413 1372.7158 1380.0436 1394.4725 1404.6121 1429.2103 1434.6733 1448.3818 1453.3684 1459.5537 1463.4926 1465.3707 1470.0075 1472.6336 1473.6507 1480.4227 1484.3175 1485.9248 1556.2191 1578.0533 1580.4290 1608.7215 1644.8332 1729.1595 2889.2614 2892.8619 2903.7117 2959.6682 2994.1460 3006.5527 3006.7455 3008.4859 3032.0898 3036.0772 3043.7349 3051.8872 3072.9187 3075.7438 3085.5160 3102.2816 3123.0084 3134.1501 3143.1572 3150.1884 3158.4770 3171.9124 3177.3637 3182.6975
redmass: 6.4642 6.5552 5.4853 5.6621 9.2500 6.2805 1.0340 5.1382 5.7567 6.5658 4.0898 4.6666 5.2611 4.8908 5.2280 4.8439 4.2291 3.0746 4.2025 4.1731 4.1456 5.2129 3.6334 3.0832 5.4603 3.2216 3.3388 3.1493 4.6319 6.3229 3.0941 3.1401 3.9863 4.4838 4.5675 3.2701 4.1514 3.3377 3.6119 3.5671 3.7361 3.9806 3.0072 6.5774 4.5950 7.6104 5.0689 10.0476 6.0896 5.7142 10.2384 4.8083 4.6677 4.5066 4.7124 2.6420 1.3565 5.2111 1.3311 1.8414 1.5019 3.7020 1.4189 1.4815 2.8202 4.0623 3.2266 1.3705 1.3514 2.1931 2.9910 1.3216 2.2887 2.5671 3.5316 4.8601 1.8463 2.6228 2.7925 2.3658 2.1649 2.9432 3.8259 1.9786 3.0870 2.5347 1.6588 2.9438 1.3423 1.4530 2.0907 1.9601 1.0692 1.1687 1.4284 1.8242 2.8131 1.4565 1.8145 1.4079 1.8502 1.4305 1.5318 1.7730 1.5353 1.5836 1.4163 1.3574 1.3667 4.1467 1.7541 1.3875 3.8495 8.3582 1.4648 2.3639 2.3178 1.2337 1.0850 2.6373 1.1003 1.1065 1.1104 1.0412 1.9042 1.0769 1.3048 1.0813 1.1225 6.6748 6.8108 7.4937 7.4131 10.9081 11.7709 1.0707 1.0700 1.0697 1.0688 1.0633 1.0327 1.0599 1.0610 1.0903 1.0885 1.0908 1.0979 1.1039 1.1036 1.0920 1.1028 1.1022 1.0852 1.0902 1.0897 1.0937 1.1005 1.0915 1.0961
irintensity: 0.5962 0.3499 0.2270 0.0766 0.1690 0.0841 0.0396 0.9421 0.6479 1.7012 4.0967 0.0417 1.2923 3.2946 1.9304 2.5062 0.7946 0.4485 0.7452 4.5645 1.7580 5.1671 1.0296 1.0331 3.1916 4.4989 5.6949 0.0202 8.3022 0.1939 14.8210 19.9395 7.6340 2.7542 10.3949 0.3743 14.6156 4.7538 2.2834 9.5611 3.3105 2.5669 9.8134 11.3833 1.2408 17.9255 0.4977 6.3827 3.4226 1.8464 6.6956 8.4505 1.7578 5.5063 4.0810 30.1052 101.5339 14.1789 36.4966 12.9534 1.1977 1.4808 5.0608 28.6302 3.7336 76.3064 18.1851 3.6459 0.6155 0.7241 46.0726 0.0729 40.5944 14.9685 208.2660 16.1864 4.0229 12.7238 53.5079 24.5841 1.5037 13.9557 20.1648 20.1813 11.7649 35.2957 13.8805 6.3938 0.5692 13.2841 14.3663 15.9136 0.8555 2.9113 46.0538 24.1506 44.2100 16.8892 43.4243 5.2745 1.3256 4.2298 53.2602 12.0801 38.2203 26.1593 29.8555 6.6367 25.7007 184.0313 3.8422 4.7301 15.8847 8.4241 9.2945 23.0516 5.6239 75.7676 8.0413 346.9857 5.3624 9.4438 9.8885 16.1003 29.9184 12.2987 2.1753 8.6284 40.9958 47.4513 5.3169 75.4771 36.0322 490.7562 303.9161 17.7329 67.7892 101.7965 45.3169 40.3042 27.0355 12.5859 16.1481 1.3865 40.2693 14.9996 48.6162 9.5822 31.0256 8.8416 13.5367 0.9508 1.1625 6.3302 2.7749 18.8006 18.3413 2.3063 1.1186
temp: 298.150 k
press: 1.00000 atm
elementType: 17 16 8 8 8 7 7 7 6 6 6 6 6 6 6 6 6 6 6 6 6 6 6 6 6 6 6 6 6 6 6 1 1 1 1 1 1 1 1 1 1 1 1 1 1 1 1 1 1 1 1 1 1 1 1
symmnumber: 1
zpe: 1129660.3 jmol-1
zpe.correction: 0.430265 hartree
zpe.thermalcorrener: 0.457602 hartree
zpe.thermalcorrenthalpy: 0.458547 hartree
zpe.thermalcorrgfe: 0.369912 hartree
zpe.sumelectzpe: -2136.662977 hartree
zpe.sumelectthermal: -2136.635640 hartree
zpe.sumelectthermalent: -2136.634695 hartree
zpe.sumelectthermalfe: -2136.723330 hartree
dipole: 0.4532 -1.0381 0.4841
dipole: 1.2318
quadrupole: -219.5807 -193.6269 -192.9284
quadrupole: -15.0631 6.7984 8.9538
quadrupole: -17.5354 8.4184 9.1169 -15.0631 6.7984 8.9538
hfenergy: -2137.0932421 hartree
pointgroup: C01 [X(C23H24Cl1N3O3S1)]
dipole: -0.1888068 -0.4267805 -0.130726 debye
polarizability: 366.6101953|-86.4479794|297.9343344|-18.8161183|-15.2286122|247.9226076 unknown
InChI: InChI=1S/C23H24ClN3O3S/c1-25-21(28)23(30-22(25)29)9-13-26(14-10-23)11-4-12-27-17-5-2-3-6-19(17)31-20-8-7-16(24)15-18(20)27/h2-3,5-8,15H,4,9-14H2,1H3
charge 0 multiplicity 1
55 atoms
Cl 6.695971 -2.684973 1.207086
S  2.878911 1.243735 -2.186176
O  -4.674656 0.661501 0.838428
O  -4.363605 -2.08486 -1.507201
O  -6.963483 1.158487 0.673305
N  -0.935777 -1.221392 0.122651
N  -5.947128 -0.575814 -0.601719
N  2.319107 0.167947 0.622375
C  -3.737635 -0.336408 0.191611
C  -3.122343 -1.2061 1.309223
C  -2.642082 0.449938 -0.559936
C  -1.960737 -2.072171 0.773982
C  -1.503953 -0.479861 -1.031746
C  0.31462 -1.953526 -0.203199
C  -4.665576 -1.129919 -0.749405
C  1.255696 -2.081328 1.017199
C  -5.975759 0.48897 0.338683
C  1.618519 -0.696931 1.603611
C  -7.141062 -1.03026 -1.322575
C  3.572539 -0.249296 0.093893
C  1.8823 1.518102 0.432188
C  4.021194 0.226688 -1.171635
C  2.116831 2.184562 -0.802202
C  4.418112 -1.136089 0.81585
C  1.223823 2.241471 1.463434
C  5.27909 -0.142509 -1.68413
C  1.71401 3.519005 -1.004412
C  5.64994 -1.522548 0.261015
C  0.781847 3.564755 1.248942
C  6.111331 -1.042747 -0.977387
C  1.024358 4.212233 0.016972
H  -3.896601 -1.84554 1.771665
H  -2.739338 -0.51523 2.082023
H  -2.232046 1.196274 0.144645
H  -3.077051 0.991063 -1.420095
H  -1.498913 -2.603634 1.625763
H  -2.356901 -2.845632 0.072045
H  -1.882928 -1.168219 -1.824635
H  -0.703994 0.140368 -1.474016
H  0.105659 -2.968639 -0.618729
H  0.844181 -1.385986 -0.990219
H  0.775294 -2.671087 1.822939
H  2.159779 -2.640371 0.71215
H  2.198029 -0.805928 2.543982
H  0.662813 -0.205039 1.843353
H  -7.561548 -0.208699 -1.925925
H  -7.909968 -1.377717 -0.612759
H  -6.835361 -1.859729 -1.980106
H  4.125185 -1.509484 1.799423
H  1.067461 1.776136 2.440905
H  5.605705 0.253686 -2.650906
H  1.92619 4.006035 -1.962123
H  0.263803 4.094626 2.055593
H  7.07627 -1.356755 -1.382542
H  0.691877 5.242045 -0.147259
