program: Gaussian 09
title: 000213507
version: EM64L-G09RevD.01
frameworkgroup: C1[X(C20H13ClN2O4)]
method: RPBEPBE
basis: SDD
operation: Freq
keyword: #p
keyword: freq=noraman
keyword: PBEPBE/SDD
title: #p freq=noraman PBEPBE/SDD
converged: NO YES NO NO
title: Mulliken charges:
elementType: Cl O O O O N N C C C C C C C C C C C C C C C C C C C C H H H H H H H H H H H H H
charge: -0.037541 -0.198392 -0.170543 -0.230981 -0.140158 -0.325599 -0.296132 0.294288 0.316279 -0.674971 0.148760 0.183493 0.407623 -0.269029 -0.321059 0.060653 -0.135169 -0.248878 -0.354001 -0.336070 0.270891 -0.211531 -0.222292 -0.243317 -0.326948 -0.249068 -0.140525 0.293262 0.276664 0.295811 0.274480 0.264457 0.267713 0.269063 0.226364 0.232826 0.232966 0.288342 0.265500 0.262770
chargesum: 0.00000
title: Mulliken charges with hydrogens summed into heavy atoms:
elementType: Cl O O O O N N C C C C C C C C C C C C C C C C C C C C
charge: -0.037541 -0.198392 -0.170543 -0.230981 -0.140158 -0.325599 -0.296132 0.294288 0.316279 -0.105045 0.148760 0.183493 0.407623 0.026782 -0.046580 0.060653 -0.135169 0.015579 -0.086288 -0.067007 0.270891 0.014833 0.010534 -0.010352 -0.038605 0.016432 0.122245
polarizability: 2.97069161e+02 3.15468351e+00 2.43588107e+02 -1.30526482e+01 2.27087870e+01 2.27331282e+02
1716.lowfreq: -6.1624 -0.0004 0.0010 0.0014 1.3941 4.4567 15.3477 30.6058 41.0822
frequency: 15.0662 30.5841 41.0763 44.2207 55.7891 61.1820 66.5119 95.5711 107.7061 114.3424 153.5728 175.7693 193.1059 203.1435 211.3956 250.7863 269.1443 277.1059 304.4898 326.3312 361.7636 385.4282 406.8023 407.5994 441.9878 461.8573 472.7380 478.5699 508.6899 534.0600 547.1678 571.9882 584.5198 589.7987 592.4890 613.7089 625.5815 635.5158 668.3758 695.9160 714.3442 719.0366 725.5640 751.8308 754.1424 770.7468 812.2800 826.3729 843.9995 847.4585 869.2662 876.4428 893.0810 902.7758 910.7845 917.9551 944.0121 950.0267 963.6312 973.9275 978.2837 989.5403 995.4170 1012.7319 1026.1701 1033.9590 1061.5338 1081.3965 1087.4813 1092.2440 1131.9353 1137.5085 1174.0765 1183.0563 1192.3263 1200.5952 1209.7039 1236.8376 1261.9217 1268.1170 1275.6298 1289.5365 1293.0380 1322.6571 1371.2092 1375.5292 1384.9846 1393.7166 1441.7972 1443.1315 1454.8698 1476.7407 1481.5010 1548.8732 1572.3662 1584.2885 1593.7905 1596.5548 1605.3585 1624.2565 1658.6820 3024.9287 3130.4234 3142.2994 3142.3742 3149.6260 3156.2468 3166.6417 3173.3358 3182.1066 3184.2113 3227.5652 3243.3439 3263.9830
redmass: 7.0804 6.4664 7.6310 4.4440 6.8968 6.4065 6.8461 6.2688 7.5033 9.0661 6.8881 6.6169 7.5037 6.4831 5.7364 8.0415 9.3201 5.3762 11.6528 6.4285 7.3025 7.5546 3.9516 2.9373 4.8563 6.3095 5.9220 3.2035 3.9903 4.5129 6.4341 7.2140 2.9921 5.6017 5.5885 6.3731 5.9491 5.9443 6.9663 2.0953 4.3952 5.6194 6.9790 1.4575 2.6815 2.2582 1.3932 6.6980 1.2585 1.3457 6.3847 1.4690 4.6068 4.1636 1.4083 1.4581 1.3390 3.8371 3.9421 1.3810 5.4558 5.1312 1.4034 1.5824 2.3564 2.9770 3.0186 1.7969 1.9748 1.9512 1.6875 1.6812 1.0525 1.4882 1.6541 1.9453 1.8788 3.8813 2.0098 3.1697 2.0168 1.8797 4.5065 1.3695 2.6921 9.5403 9.6422 4.2274 1.4975 1.4602 5.1747 2.7101 2.3475 6.6662 8.9869 8.3273 8.8684 6.6140 6.3235 8.9237 11.7596 1.0651 1.0853 1.0894 1.0984 1.0900 1.0940 1.0988 1.0926 1.0963 1.0971 1.0913 1.0991 1.1099
irintensity: 1.1380 0.1007 2.2716 0.7579 1.0196 0.6433 1.4309 0.0712 0.4718 5.6856 2.2685 3.3512 1.4242 1.4526 0.6482 3.3063 0.7043 3.1958 1.6171 1.3533 1.5379 0.7529 0.7802 0.6444 11.5899 4.3159 10.0048 2.3822 21.3063 31.2591 5.9147 1.1643 6.7596 7.5545 12.9106 0.8958 3.8991 3.5774 1.4252 22.2305 12.6548 25.3904 38.9164 27.3012 83.7077 12.9962 24.1902 87.2458 5.7077 13.4338 7.2928 12.9297 10.1053 6.7146 1.1302 1.8621 0.9171 1.6631 12.4293 0.1760 34.4481 0.5296 1.3740 18.9634 15.6379 17.1887 59.4357 54.3289 22.7363 44.2150 20.6273 36.3955 0.3149 9.8747 31.3140 63.3947 78.3954 216.9607 95.5524 102.1652 105.7447 42.6735 276.6871 8.0402 5.4253 0.6029 1.1757 21.9380 28.6807 10.0957 69.6827 155.0555 67.2364 48.6105 12.1870 58.3142 158.9360 3.8569 17.5856 186.7950 511.7824 2.2292 0.8268 10.7160 0.1300 2.1894 20.2204 19.1766 0.1002 0.3764 2.3961 0.9377 1.7022 0.2403
temp: 298.150 k
press: 1.00000 atm
elementType: 17 8 8 8 8 7 7 6 6 6 6 6 6 6 6 6 6 6 6 6 6 6 6 6 6 6 6 1 1 1 1 1 1 1 1 1 1 1 1 1
symmnumber: 1
zpe: 746945.7 jmol-1
zpe.correction: 0.284497 hartree
zpe.thermalcorrener: 0.306779 hartree
zpe.thermalcorrenthalpy: 0.307723 hartree
zpe.thermalcorrgfe: 0.230512 hartree
zpe.sumelectzpe: -1638.513736 hartree
zpe.sumelectthermal: -1638.491454 hartree
zpe.sumelectthermalent: -1638.490510 hartree
zpe.sumelectthermalfe: -1638.567720 hartree
dipole: -1.3475 5.8342 3.9983
dipole: 7.2000
quadrupole: -157.2464 -187.1675 -140.1769
quadrupole: 16.2817 9.2637 -2.2925
quadrupole: 4.2839 -25.6373 21.3534 16.2817 9.2637 -2.2925
hfenergy: -1638.7982323 hartree
pointgroup: C01 [X(C20H13Cl1N2O4)]
dipole: -0.1840046 -2.8074196 -0.3298135 debye
polarizability: 296.7704867|8.5931086|260.1960733|6.6737649|7.5838477|211.0219904 unknown
InChI: InChI=1S/C20H13ClN2O4/c21-13-8-9-15-16(11-13)22(14-5-2-1-3-6-14)18(24)12-19(25)23(15)20(26)17-7-4-10-27-17/h1-11H,12H2
charge 0 multiplicity 1
40 atoms
Cl -1.113452 -3.67731 3.187503
O  -2.148542 2.94005 0.075341
O  1.751148 3.407172 0.140151
O  1.64413 -0.835207 -1.526735
O  3.897601 1.452349 0.212503
N  -1.394094 0.742922 0.41856
N  1.570034 1.097173 0.571321
C  -0.532642 -0.169263 1.118467
C  0.879661 0.010453 1.208531
C  -0.159402 2.636173 1.468123
C  -1.32966 2.148265 0.606787
C  1.147535 2.461648 0.690399
C  -2.433692 0.173224 -0.428081
C  -1.126075 -1.300667 1.73983
C  1.653709 -0.931397 1.937793
C  2.855314 0.812053 -0.068369
C  -0.324869 -2.231041 2.41494
C  1.070675 -2.065044 2.530918
C  -2.056329 -0.766078 -1.417397
C  -3.789878 0.540271 -0.267827
C  2.857553 -0.258194 -1.072078
C  -3.042952 -1.349557 -2.240041
C  -4.768938 -0.040935 -1.103748
C  -4.402293 -0.988782 -2.086807
C  3.924618 -0.832715 -1.761919
C  3.374452 -1.796834 -2.676311
C  1.995854 -1.769328 -2.506068
H  -0.303267 3.710724 1.643237
H  -0.120249 2.097491 2.431993
H  -2.208328 -1.439516 1.676187
H  2.731026 -0.765029 2.038728
H  1.679166 -2.789982 3.077407
H  -0.997566 -1.018402 -1.536342
H  -4.071666 1.281504 0.483768
H  -2.751498 -2.075601 -3.007052
H  -5.818768 0.24748 -0.984473
H  -5.166598 -1.437663 -2.730383
H  4.970231 -0.568454 -1.619636
H  3.922884 -2.426469 -3.373588
H  1.170367 -2.304984 -2.968031
