program: Gaussian 09
title: 000213501
version: EM64L-G09RevD.01
frameworkgroup: C1[X(C21H16N2O2)]
method: RPBEPBE
basis: SDD
operation: Freq
keyword: #p
keyword: freq=noraman
keyword: PBEPBE/SDD
title: #p freq=noraman PBEPBE/SDD
converged: YES YES NO NO
title: Mulliken charges:
elementType: O O N N C C C C C C C C C C C C C C C C C C C C C H H H H H H H H H H H H H H H H
charge: -0.209804 -0.207239 -0.241037 -0.236789 -0.450086 0.156138 0.091980 0.425286 0.460729 0.460748 -0.383223 -0.346414 -0.379605 -0.373540 -0.346586 -0.352921 -0.232443 -0.237098 -0.238563 -0.211859 -0.212660 -0.205298 -0.205256 -0.247783 -0.247476 0.295521 0.255714 0.261282 0.278779 0.276084 0.263449 0.264650 0.227077 0.228306 0.229411 0.231256 0.231617 0.231141 0.231285 0.232427 0.232800
chargesum: 0.00000
title: Mulliken charges with hydrogens summed into heavy atoms:
elementType: O O N N C C C C C C C C C C C C C C C C C C C C C
charge: -0.209804 -0.207239 -0.241037 -0.236789 -0.154565 0.156138 0.091980 0.425286 0.460729 0.460748 -0.127509 -0.085132 -0.100826 -0.097456 -0.083137 -0.088271 -0.005366 -0.008792 -0.009153 0.019397 0.018957 0.025842 0.026029 -0.015355 -0.014676
polarizability: 3.05342848e+02 -3.39210522e+00 2.42012355e+02 4.98493449e+00 -3.18885382e+01 1.77985705e+02
1716.lowfreq: -3.7861 -0.0008 -0.0005 0.0006 4.3345 10.2199 22.1414 23.6455 36.3076
frequency: 22.0277 23.5693 36.2875 53.6841 60.6870 63.8117 79.9816 94.8496 134.7037 164.3670 210.6548 215.8101 239.4959 264.1673 291.2580 298.4625 332.5645 380.9923 388.8187 402.2939 404.9348 407.0518 437.3807 482.6446 493.9697 509.8282 515.4946 579.2327 590.3173 611.5775 613.8734 616.4425 637.0512 658.6302 690.4884 692.3263 699.6196 718.9762 738.6606 755.2041 767.6218 775.0847 837.0861 837.9362 842.3554 852.9163 858.2440 911.6812 912.7653 925.9257 944.3151 970.3888 971.3906 975.8391 978.2108 987.2573 988.3023 992.4006 992.7846 993.5463 997.5349 1026.0340 1026.2746 1032.7699 1074.3936 1083.6433 1091.3489 1109.9307 1144.1648 1174.5042 1174.7075 1174.8658 1181.8054 1184.5213 1189.5387 1190.1241 1199.4251 1201.1426 1242.8899 1289.9423 1292.8244 1322.4209 1330.2387 1338.1388 1380.3357 1383.4636 1385.9860 1437.2651 1443.2628 1448.4997 1479.0824 1481.7015 1486.2817 1592.4540 1592.8471 1594.6784 1603.8245 1607.9855 1612.0686 1631.8878 1662.6158 2991.5771 3126.8073 3133.5175 3133.8331 3138.1773 3144.6906 3145.0053 3152.3397 3160.7736 3161.0339 3162.3512 3170.4831 3172.5079 3172.6999 3191.2871 3191.4921
redmass: 5.5176 4.6429 5.5092 3.9153 4.5128 4.3102 6.7056 7.0737 5.7564 6.2890 5.5843 5.0640 5.3282 4.9764 6.2799 8.4577 7.9287 6.4032 8.1516 2.8400 2.9102 2.8919 6.1932 3.5743 4.0805 4.0407 5.4998 5.3396 7.7718 6.4453 6.3085 6.4249 7.3924 6.3450 2.3955 2.2625 2.3701 2.0526 2.4503 1.7904 2.1733 2.6783 1.2500 1.2856 3.8328 1.2542 6.7162 1.4174 1.3895 1.5462 4.9463 1.4014 1.4024 3.1053 1.7214 5.9856 5.6441 4.4767 1.3465 1.3196 1.3157 2.2516 2.2940 2.1382 2.1822 1.6963 1.5881 2.6566 3.6647 1.0505 1.0515 1.0589 2.8035 1.3862 1.1401 1.1563 1.1388 1.6999 3.9000 5.4512 3.1903 1.3362 1.3099 1.6000 7.8640 8.9226 10.4403 2.2358 2.3217 2.3677 2.3056 2.2747 2.2256 6.4136 6.1295 6.6453 6.1860 6.0259 5.8680 11.8009 12.4380 1.0810 1.0849 1.0853 1.0853 1.0889 1.0900 1.0900 1.0934 1.0948 1.0946 1.0955 1.1005 1.0984 1.0984 1.0962 1.0961
irintensity: 1.2212 0.6207 0.4947 0.4224 0.9313 0.0379 0.8977 1.2626 2.1714 2.2240 2.0860 3.6092 3.1113 1.3563 0.5919 12.1535 4.9540 0.3541 1.4579 0.2318 1.2919 1.1007 11.2160 20.5504 9.7999 12.9376 2.5334 18.1812 19.1758 0.8877 0.3113 1.2414 10.9580 0.3899 23.3541 18.7679 43.3093 40.3343 71.7753 61.9732 35.3081 24.8161 0.6338 0.8321 7.6905 1.3339 0.7594 5.2033 2.5032 3.6040 11.6020 0.3945 0.5773 3.0705 0.3226 0.1700 0.0890 2.1426 0.1305 0.3361 0.2216 10.0164 17.5197 4.7346 0.0593 2.8791 20.3584 2.0341 7.8955 0.0489 0.0597 0.3121 39.7248 18.2015 3.2470 0.6045 24.8076 82.1786 124.2408 406.8028 51.0819 1.1495 1.9628 1.4884 0.1574 3.6479 0.5645 15.6306 5.7594 15.4284 53.4192 141.4819 11.8066 4.7179 0.4882 7.8862 7.2186 70.6475 7.7230 282.7280 229.6469 3.8064 0.0400 0.2333 0.1410 12.1538 12.9112 12.0636 24.8353 38.5555 21.1253 13.4572 16.0819 8.2572 10.1660 0.8995 1.0051
temp: 298.150 k
press: 1.00000 atm
elementType: 8 8 7 7 6 6 6 6 6 6 6 6 6 6 6 6 6 6 6 6 6 6 6 6 6 1 1 1 1 1 1 1 1 1 1 1 1 1 1 1 1
symmnumber: 1
zpe: 826465.5 jmol-1
zpe.correction: 0.314784 hartree
zpe.thermalcorrener: 0.334871 hartree
zpe.thermalcorrenthalpy: 0.335815 hartree
zpe.thermalcorrgfe: 0.263744 hartree
zpe.sumelectzpe: -1068.058399 hartree
zpe.sumelectthermal: -1068.038312 hartree
zpe.sumelectthermalent: -1068.037367 hartree
zpe.sumelectthermalfe: -1068.109439 hartree
dipole: 2.8585 0.8282 1.1023
dipole: 3.1736
quadrupole: -126.3470 -147.5737 -136.5040
quadrupole: -0.1591 -1.6417 -4.6415
quadrupole: 10.4612 -10.7654 0.3042 -0.1591 -1.6417 -4.6415
hfenergy: -1068.3731828 hartree
pointgroup: C01 [X(C21H16N2O2)]
dipole: -1.1249774 0.3834223 -0.3826636 debye
polarizability: 305.6344958|2.2832352|236.3558518|3.4801165|36.4760554|183.3505609 unknown
InChI: InChI=1S/C21H16N2O2/c24-20-19(16-10-4-1-5-11-16)21(25)23(18-14-8-3-9-15-18)22(20)17-12-6-2-7-13-17/h1-15,19H
charge 0 multiplicity 1
41 atoms
O  1.429686 1.751383 1.637982
O  0.748022 -2.786706 0.032686
N  -0.333276 0.547023 0.61991
N  -0.532961 -0.800942 0.136438
C  1.697827 -0.652656 0.946364
C  0.969266 0.690652 1.150129
C  0.648282 -1.563802 0.303117
C  3.021361 -0.492041 0.179415
C  -1.14403 1.629949 0.126583
C  -1.859088 -1.359769 0.069535
C  3.266371 -1.169623 -1.039371
C  4.025181 0.350413 0.722088
C  -1.296085 2.787535 0.929437
C  -2.101485 -2.42715 -0.830076
C  -1.753344 1.552255 -1.15065
C  -2.894669 -0.872719 0.905486
C  4.498538 -0.997956 -1.71134
C  5.253762 0.51841 0.048072
C  5.495324 -0.154557 -1.172293
C  -2.056967 3.870896 0.440146
C  -3.38563 -3.010549 -0.879606
C  -2.523427 2.637824 -1.61707
C  -4.176513 -1.456768 0.831992
C  -2.678118 3.801175 -0.828014
C  -4.428754 -2.527543 -0.056499
H  1.927539 -1.082742 1.942274
H  2.514307 -1.848318 -1.45298
H  3.832614 0.890686 1.654617
H  -0.809171 2.840804 1.905379
H  -1.293015 -2.802555 -1.460842
H  -1.624418 0.660099 -1.769817
H  -2.701438 -0.052634 1.602637
H  4.679032 -1.529269 -2.652518
H  6.020184 1.174322 0.475557
H  6.449967 -0.025149 -1.694363
H  -2.16691 4.768947 1.057442
H  -3.569352 -3.841614 -1.568915
H  -2.997336 2.574926 -2.602572
H  -4.976925 -1.076123 1.475568
H  -3.274672 4.6421 -1.197218
H  -5.425382 -2.978708 -0.106808
