program: Gaussian 09
title: 000213452
version: EM64L-G09RevD.01
frameworkgroup: C1[X(C12H18NO2)]
method: RPBEPBE
basis: SDD
operation: Freq
keyword: #p
keyword: freq=noraman
keyword: PBEPBE/SDD
title: #p freq=noraman PBEPBE/SDD
converged: YES YES NO NO
title: Mulliken charges:
elementType: O O N C C C C C C C C C C C C H H H H H H H H H H H H H H H H H H
charge: -0.484347 -0.227141 -0.115797 -0.305403 -0.457482 -0.578656 -0.591922 -0.351487 0.146009 0.293183 -0.329565 -0.328317 -0.235378 -0.217004 -0.201963 0.253880 0.323565 0.280752 0.285663 0.306262 0.257578 0.258479 0.237501 0.321355 0.306057 0.221229 0.250107 0.393415 0.233361 0.285505 0.252498 0.258640 0.259424
chargesum: 1.00000
title: Mulliken charges with hydrogens summed into heavy atoms:
elementType: O O N C C C C C C C C C C C C
charge: -0.090932 -0.227141 -0.115797 0.272042 0.108933 0.243663 0.272991 0.119849 0.146009 0.293183 -0.096204 -0.042812 0.017120 0.041635 0.057461
polarizability: 2.03208068e+02 7.00321632e+00 1.31881876e+02 -5.66442518e+00 -3.96547430e+00 8.85353960e+01
1716.lowfreq: -21.5413 -2.9130 -0.0002 0.0009 0.0011 3.2572 33.2249 44.5570 72.1414
frequency: 32.8001 44.3906 72.0951 120.5342 140.3165 153.1839 178.1453 190.4046 246.3621 269.1685 290.7711 308.2081 311.7306 324.3654 339.8943 393.3340 393.4912 410.6769 420.1001 431.4009 471.4820 559.8923 584.1807 610.8236 657.3941 689.0469 698.5714 772.8518 792.5887 833.2054 852.5045 860.4420 902.7931 935.3326 944.9375 964.9371 987.5810 990.9814 998.3551 1006.5010 1022.1969 1027.8719 1053.8195 1069.6553 1096.8301 1113.0004 1138.1212 1184.2801 1186.6927 1190.3808 1198.7221 1229.2668 1240.2202 1256.7557 1286.9807 1314.2391 1322.7750 1347.0985 1377.3161 1395.4819 1412.4773 1413.7465 1434.2177 1439.9777 1444.0060 1462.8629 1465.6730 1467.2129 1483.3026 1485.0174 1496.7637 1510.8892 1565.2893 1594.3405 1610.5936 2974.2371 3011.6103 3020.7858 3024.5894 3026.2308 3040.6467 3080.7441 3132.9028 3135.3031 3136.1916 3146.8211 3149.4510 3150.1006 3159.9478 3166.0403 3170.0396 3181.6892 3598.2315
redmass: 4.9950 3.4470 4.7527 3.8644 3.5685 5.4547 4.2433 2.8717 1.1629 2.3665 2.4585 1.2335 4.9377 1.1695 2.1907 3.1326 2.7979 2.6456 2.3567 2.7026 5.8971 2.4901 2.7940 6.4523 5.6257 1.7861 3.5334 1.7217 5.2488 2.1797 1.2683 3.1888 3.3374 2.0160 1.7713 2.1385 5.4655 2.5761 1.4464 3.0663 1.3716 2.0405 1.7347 2.1980 1.6125 1.3184 1.6559 1.0710 1.0943 1.3610 1.1280 1.6998 1.5636 1.8236 1.3375 1.3029 1.3449 1.4732 1.2969 7.7708 1.1776 1.3036 1.1729 2.0660 1.1639 1.0868 1.1049 1.0707 1.3764 1.3947 1.0568 1.0563 5.9716 6.5109 6.2033 1.0575 1.0585 1.0421 1.0754 1.0504 1.0657 1.1042 1.1024 1.0879 1.1048 1.1051 1.1052 1.0881 1.0915 1.1064 1.0966 1.1017 1.0672
irintensity: 0.9224 0.6784 1.5762 5.0014 7.6512 1.0143 4.4081 7.2878 1.5389 8.2563 2.0922 31.8749 26.1130 114.9006 21.3352 2.9537 0.0944 1.4068 3.4468 0.7687 13.4546 5.3044 4.3639 0.9220 28.4966 48.7896 5.6440 65.3458 0.2909 3.2640 0.9808 24.0208 118.0636 18.1189 6.9267 7.4385 5.3130 15.4435 1.7773 9.1866 0.1993 1.7614 32.5209 21.0369 9.1148 4.9201 0.7857 4.1218 14.1968 8.2949 20.6570 26.0464 72.6914 135.6918 8.1992 7.3359 0.8711 37.2954 12.3886 3.0410 47.1751 7.6890 11.0754 43.3281 6.7052 2.4165 27.1756 18.9285 13.8608 11.9802 28.3020 56.1625 154.5462 115.3379 10.5772 35.3875 5.4830 1.9439 17.1991 27.6819 6.4438 1.2070 5.4130 10.1106 5.4652 0.6643 0.8699 1.1683 4.8456 12.8902 6.5161 8.9150 36.1018
temp: 298.150 k
press: 1.00000 atm
elementType: 8 8 7 6 6 6 6 6 6 6 6 6 6 6 6 1 1 1 1 1 1 1 1 1 1 1 1 1 1 1 1 1 1
symmnumber: 1
zpe: 740664.4 jmol-1
zpe.correction: 0.282104 hartree
zpe.thermalcorrener: 0.297335 hartree
zpe.thermalcorrenthalpy: 0.298279 hartree
zpe.thermalcorrgfe: 0.239828 hartree
zpe.sumelectzpe: -671.861925 hartree
zpe.sumelectthermal: -671.846694 hartree
zpe.sumelectthermalent: -671.845750 hartree
zpe.sumelectthermalfe: -671.904201 hartree
dipole: -5.2117 3.7441 -1.4980
dipole: 6.5897
quadrupole: -22.4182 -77.4658 -83.1395
quadrupole: -0.3790 5.2209 2.0368
quadrupole: 38.5896 -16.4580 -22.1317 -0.3790 5.2209 2.0368
hfenergy: -672.1440292 hartree
pointgroup: C01 [X(C12H18N1O2)]
dipole: -2.1222532 0.437471 -1.4234442 debye
polarizability: 202.2961542|5.203942|104.4085401|-10.4818537|-21.7871597|116.9206448 unknown
InChI: InChI=1S/C12H18NO2/c1-13(2,8-9-14)10-12(15)11-6-4-3-5-7-11/h3-7,14H,8-10H2,1-2H3
charge 1 multiplicity 1
33 atoms
O  -4.742506 -0.742481 0.542968
O  -0.012211 -0.859849 1.360675
N  -2.101559 0.35175 -0.189828
C  -2.460758 -1.165927 -0.186038
C  -0.620149 0.542645 -0.552538
C  -2.922767 1.099757 -1.241396
C  -2.397825 0.975108 1.187733
C  -3.93721 -1.489968 -0.426014
C  0.395605 -0.1868 0.36724
C  1.829991 -0.046876 0.02444
C  2.290978 0.714156 -1.090444
C  2.777765 -0.706287 0.861397
C  3.669826 0.809418 -1.358977
C  4.153611 -0.608626 0.587639
C  4.602351 0.148876 -0.522404
H  -1.861099 -1.639295 -0.983822
H  -2.115745 -1.548518 0.784429
H  -0.494415 0.200322 -1.595456
H  -0.422255 1.62965 -0.525639
H  -3.980429 1.068764 -0.94374
H  -2.577885 2.144736 -1.277219
H  -2.780785 0.627788 -2.226196
H  -2.17376 2.052536 1.132248
H  -3.458909 0.795717 1.40741
H  -1.760775 0.482385 1.933607
H  -4.252039 -1.25417 -1.462582
H  -4.031713 -2.585714 -0.284635
H  -5.650254 -1.125961 0.623875
H  1.5923 1.236419 -1.753966
H  2.410103 -1.28452 1.715042
H  4.022572 1.394003 -2.214291
H  4.877301 -1.116578 1.232357
H  5.673746 0.225139 -0.735078
