program: Gaussian 09
title: 000015384
version: EM64L-G09RevD.01
frameworkgroup: C1[X(C9H14NO)]
method: RPBEPBE
basis: SDD
operation: Freq
keyword: #p
keyword: freq=noraman
keyword: PBEPBE/SDD
title: #p freq=noraman PBEPBE/SDD
converged: NO YES NO NO
title: Mulliken charges:
elementType: O N C C C C C C C C C H H H H H H H H H H H H H H
charge: -0.411375 -0.233547 0.583518 -0.555432 -0.555505 -0.593242 -0.470883 -0.376605 0.292684 -0.201301 -0.375760 0.274373 0.281826 0.259487 0.274505 0.259502 0.281789 0.279443 0.266131 0.279525 0.288102 0.246415 0.259165 0.260026 0.387157
chargesum: 1.00000
title: Mulliken charges with hydrogens summed into heavy atoms:
elementType: O N C C C C C C C C C
charge: -0.024218 -0.233547 0.583518 0.260254 0.260292 0.231857 -0.182781 -0.130191 0.292684 0.057865 -0.115734
polarizability: 1.32786961e+02 -2.03554132e+00 1.07646911e+02 2.16940109e-03 -8.17062135e-04 6.28284210e+01
1716.lowfreq: -15.1671 -0.0012 -0.0010 -0.0009 9.4282 13.6286 43.9967 132.2464 179.0907
frequency: 42.7681 132.2246 179.0258 209.5311 221.0727 254.5531 290.4421 326.8370 328.5970 356.9352 407.8698 409.1285 419.7451 466.4291 479.0956 520.2211 541.6412 617.5144 678.0065 687.9099 782.6256 796.8267 874.7735 883.5515 895.2590 921.6282 934.5835 980.4453 984.8828 1042.6533 1084.2426 1103.2632 1105.7003 1109.8212 1144.4836 1195.6033 1215.4236 1221.0535 1249.1012 1274.3730 1313.0045 1401.5615 1416.9452 1421.4325 1449.3160 1454.1726 1463.6871 1463.7508 1472.1311 1477.4037 1483.2243 1487.7456 1501.5786 1597.1319 1626.2541 3028.7217 3029.6440 3034.2353 3143.3133 3143.6459 3146.5956 3150.7628 3156.8048 3157.3853 3162.7778 3166.6304 3180.0576 3198.6493 3584.1534
redmass: 3.4069 2.7443 1.0737 3.2612 4.2670 1.0948 3.1158 1.1009 2.7341 3.0460 2.5296 3.2390 1.1116 2.9801 3.3601 5.8257 3.2362 4.4166 6.0695 2.1517 1.4070 3.8979 1.6354 1.4175 4.3958 2.5210 2.7479 1.3338 6.0882 1.1919 1.6965 1.3015 1.6624 1.4403 1.3062 1.0971 1.8715 1.7864 1.8706 2.7978 1.3304 6.6079 1.1434 1.1365 1.0477 1.1792 1.1625 1.0678 1.9572 1.1939 1.0457 1.9545 1.0800 6.7529 6.3407 1.0323 1.0323 1.0331 1.1056 1.1057 1.0901 1.1055 1.1054 1.0927 1.1055 1.1027 1.0990 1.0920 1.0667
irintensity: 0.0001 4.2525 0.1043 3.0581 0.2664 0.3229 4.3986 0.7626 6.8459 1.7005 0.6381 8.5038 156.7024 10.8285 1.0053 0.4719 0.2579 0.0154 0.2559 34.8623 47.5766 11.2940 18.0897 1.7496 88.4292 25.8127 18.7945 0.4532 4.5653 0.0567 6.5022 0.4832 19.7711 3.6283 192.6890 4.5802 0.0748 0.2520 4.7412 18.4905 24.6421 21.6990 15.5502 17.5013 0.0122 4.8757 20.4873 6.7328 16.2283 47.2276 35.5126 61.6837 60.5397 33.0297 121.6023 2.3234 3.4711 4.4409 0.2458 0.3381 2.5920 14.3301 0.9609 6.5931 1.0170 2.8112 1.0267 0.6308 98.8693
temp: 298.150 k
press: 1.00000 atm
elementType: 8 7 6 6 6 6 6 6 6 6 6 1 1 1 1 1 1 1 1 1 1 1 1 1 1
symmnumber: 1
zpe: 566327.5 jmol-1
zpe.correction: 0.215703 hartree
zpe.thermalcorrener: 0.226770 hartree
zpe.thermalcorrenthalpy: 0.227714 hartree
zpe.thermalcorrgfe: 0.179712 hartree
zpe.sumelectzpe: -480.226144 hartree
zpe.sumelectthermal: -480.215077 hartree
zpe.sumelectthermalent: -480.214133 hartree
zpe.sumelectthermalfe: -480.262135 hartree
dipole: -4.3647 0.5804 0.0002
dipole: 4.4031
quadrupole: -23.3032 -54.6470 -62.6493
quadrupole: 4.3563 0.0014 -0.0008
quadrupole: 23.5633 -7.7805 -15.7828 4.3563 0.0014 -0.0008
hfenergy: -480.441847 hartree
pointgroup: C01 [X(C9H14N1O1)]
dipole: 1.7167194 0.2318743 -0.0015518 debye
dipolederiv: -0.8457261 -0.653841 0.0023853 -0.7526731 -0.7330174 0.0013602 0.0027302 0.001355 -0.4067826 -0.3492432 0.021759 -0.0000534 -0.0228678 -0.2842666 0.0001308 0.0005564 0.0000088 -0.2540851 0.6202486 -0.0111256 -0.0005044 -0.1384554 0.34318 -0.0013547 -0.0003836 -0.001375 -0.0955586 0.08074 0.0483429 0.1044815 0.0764172 0.0742295 0.0839849 0.1689821 0.0704079 0.2482786 0.0800031 0.0472373 -0.104634 0.0746918 0.0726782 -0.0824189 -0.169595 -0.0688325 0.2503439 0.0431688 -0.0246675 0.0002138 -0.0868727 0.3034262 -0.0012079 0.0004532 -0.0011889 0.057479 -0.3873535 -0.3237802 0.0012255 0.1123301 -0.1279974 -0.0002026 -0.0002542 -0.0000639 -0.1392345 -0.3071056 0.130404 -0.000273 0.0570374 -0.234543 0.0002918 0.00004 0.0003738 -0.1687334 0.8591719 0.6980486 -0.0026346 0.8006731 0.7345236 -0.0023374 -0.0029143 -0.002313 0.1194719 0.2446429 -0.0716023 0.0000739 0.0688095 0.1743355 -0.0008877 -0.0003965 -0.0008323 -0.0828448 -0.0071285 -0.0092417 -0.0000522 -0.3711371 -0.3130143 0.0006516 0.0011692 0.0005117 -0.1627498 0.1544946 0.049355 -0.0169458 0.0231255 -0.0330461 -0.0071559 -0.0065015 0.0446201 0.0886176 0.0892451 -0.057233 0.0584168 -0.0526443 0.0750628 0.0603435 0.0382812 0.0162693 0.0353207 -0.0693046 0.0380134 -0.0125726 0.0741286 0.1076665 -0.0216453 0.0260543 -0.0286748 0.0825147 0.1543521 0.0493962 0.0164428 0.0232544 -0.0332947 0.008302 0.006115 -0.0435537 0.0889674 -0.0693679 0.0382026 0.0124997 0.0738063 0.1081527 0.0212768 -0.0263477 0.0283751 0.0820237 0.0890647 -0.0578875 -0.0579735 -0.0531139 0.074302 -0.060699 -0.0378926 -0.0165187 0.0362654 0.1116423 -0.0463244 -0.0747911 -0.010027 0.0751845 -0.0021711 -0.0742066 -0.0276936 0.0078821 -0.0693086 0.0299789 -0.0000555 -0.0497427 0.0973825 0.0002111 0.0003019 0.0001808 0.1309648 0.1117491 -0.0454873 0.0750765 -0.0092924 0.0754996 0.0015018 0.0742168 0.0270222 0.0075246 0.1323571 0.0332192 -0.0001003 0.0532536 0.0301814 0.0004581 -0.0001804 0.0004481 0.1643631 -0.0116639 -0.0864153 0.0003219 -0.0971217 0.069434 0.0003026 0.000344 0.0002357 0.1653 0.0773678 0.0285379 -0.0000649 0.0320023 -0.0176573 0.0005631 -0.0000808 0.00056 0.158815 -0.0511991 0.0083983 0.0000632 -0.0103446 0.0976222 0.0002735 0.0001314 0.0002606 0.1802497 0.3191529 0.1667124 -0.0005459 0.1847629 0.2639758 0.0004287 -0.0006226 0.0004173 0.4056067 unknown
polarizability: 132.7784649|2.0871681|107.6549069|-0.0340533|-0.1482161|62.8289215 unknown
InChI: InChI=1S/C9H14NO/c1-10(2,3)8-5-4-6-9(11)7-8/h4-7,11H,1-3H3
charge 1 multiplicity 1
25 atoms
O  -2.879844 -1.609598 0.006632
N  1.831897 -0.207338 -0.000037
C  0.335626 0.134637 -0.000426
C  2.49154 0.387802 1.252807
C  2.489188 0.375296 -1.259997
C  2.096789 -1.712597 0.007355
C  -0.624747 -0.890078 0.003371
C  -0.033311 1.499986 -0.004844
C  -1.998961 -0.537199 0.002704
C  -1.407468 1.824755 -0.005333
C  -2.396622 0.82103 -0.001659
H  2.363853 1.478344 1.25176
H  2.002313 -0.038255 2.140981
H  3.563246 0.1346 1.243343
H  2.361417 1.465778 -1.26947
H  3.560889 0.12207 -1.250183
H  1.99818 -0.059539 -2.142933
H  1.661097 -2.168109 -0.893304
H  3.186547 -1.865427 0.007804
H  1.661406 -2.159069 0.912685
H  -0.388316 -1.955239 0.007079
H  0.70235 2.309475 -0.007567
H  -1.706877 2.876893 -0.008605
H  -3.458149 1.093073 -0.002109
H  -3.829645 -1.33049 0.005945
