program: Gaussian 09
title: 000213513
version: EM64L-G09RevD.01
frameworkgroup: C1[X(C20H13ClN2O3S)]
method: RPBEPBE
basis: SDD
operation: Freq
keyword: #p
keyword: freq=noraman
keyword: PBEPBE/SDD
title: #p freq=noraman PBEPBE/SDD
converged: YES YES NO NO
title: Mulliken charges:
elementType: Cl S O O O N N C C C C C C C C C C C C C C C C C C C C H H H H H H H H H H H H H
charge: -0.039012 0.339637 -0.206954 -0.176594 -0.193082 -0.323131 -0.322120 0.268122 0.274710 -0.663894 0.127988 0.160812 0.414106 -0.278433 -0.271027 0.244259 -0.120986 -0.258674 -0.362786 -0.335087 -0.220921 -0.214395 -0.221199 -0.241078 -0.208513 -0.137794 -0.506700 0.294191 0.282131 0.295832 0.300785 0.265133 0.257114 0.269988 0.233477 0.233411 0.234321 0.275366 0.257985 0.273011
chargesum: 0.00000
title: Mulliken charges with hydrogens summed into heavy atoms:
elementType: Cl S O O O N N C C C C C C C C C C C C C C C C C C C C
charge: -0.039012 0.339637 -0.206954 -0.176594 -0.193082 -0.323131 -0.322120 0.268122 0.274710 -0.087572 0.127988 0.160812 0.414106 0.017399 0.029758 0.244259 -0.120986 0.006459 -0.105673 -0.065098 -0.220921 0.019082 0.012212 -0.006757 0.066853 0.120191 -0.233689
polarizability: 3.06584266e+02 2.59639777e+00 2.93951604e+02 3.30661179e+00 1.03199981e+01 2.01323024e+02
1716.lowfreq: -4.1285 -0.0009 0.0008 0.0010 4.4585 5.5489 11.8678 22.0556 38.8024
frequency: 11.7292 22.0398 38.7885 40.6951 44.9500 63.3887 65.3939 90.9012 109.6930 131.6471 150.4364 154.3574 180.9622 203.9802 212.0934 234.4244 265.5224 276.9146 290.1515 335.7907 360.1698 373.1232 399.6053 404.0053 428.6193 444.0047 459.6205 473.9617 478.8414 499.2899 515.0465 546.2928 558.5573 571.2532 592.4114 613.7716 624.9346 633.6577 659.0427 666.9558 685.7807 694.4940 701.4398 719.3765 726.2328 727.5312 754.5287 767.2569 797.7275 822.5333 837.4826 840.5425 851.3926 873.0972 900.8144 915.2615 929.0196 943.6557 956.0057 964.4066 972.0329 978.2557 989.4882 995.3831 998.6703 1026.9607 1067.7799 1084.2518 1086.0534 1091.4576 1097.4710 1131.1473 1174.5373 1183.2359 1193.2555 1196.3546 1212.5166 1232.4080 1249.0403 1261.2092 1275.1483 1289.8995 1294.8567 1321.8676 1344.8307 1370.4426 1384.4002 1393.6803 1437.1673 1442.6690 1450.6984 1475.0440 1480.8997 1519.3984 1573.1812 1585.0879 1595.4046 1598.2598 1603.6714 1616.0180 1636.3572 3023.5437 3132.7379 3139.5074 3141.3212 3153.3337 3167.6871 3173.4854 3174.2308 3180.9584 3185.4741 3195.5404 3197.0370 3234.8035
redmass: 7.4877 6.8744 6.8334 5.1832 7.1295 7.3559 8.5764 5.8948 8.7564 7.7368 8.7320 6.2587 6.9566 6.8794 5.7641 8.5882 9.1844 5.5397 8.3188 9.5806 7.7496 7.5276 4.4061 2.8443 6.2471 4.1640 5.4357 3.4061 5.9915 5.0136 4.4032 4.9004 3.3756 5.8998 5.3800 6.4423 6.3574 6.5236 7.5070 7.2791 6.3411 2.0286 6.1575 6.0009 1.2298 4.7659 3.7962 2.1772 6.0542 1.4074 4.1402 1.3115 1.3739 1.4617 4.3129 1.4387 1.4045 3.3799 1.3990 5.8788 1.3988 5.6352 5.7393 1.3548 3.7354 2.1255 1.6922 1.6888 1.8749 1.1752 1.6891 1.7774 1.0513 1.4819 1.5728 2.5011 2.1040 3.9309 2.5254 1.6355 1.7040 2.1933 5.0968 1.4062 2.5010 10.2125 9.3050 4.1366 1.0944 2.2780 6.4773 2.6979 2.3288 5.7937 8.6583 7.2466 7.1752 10.0696 6.6876 7.8361 11.7378 1.0651 1.0853 1.0982 1.0891 1.0944 1.0991 1.0923 1.0908 1.0902 1.0970 1.0963 1.0977 1.1005
irintensity: 2.8200 0.0278 0.2775 0.3898 3.4087 0.3734 3.8007 0.1208 0.5877 5.1717 0.4785 1.0055 0.4656 2.7288 0.9819 4.2778 1.6427 3.9462 1.1021 3.2242 1.3896 0.6296 1.4797 0.6526 7.7433 4.0762 1.2054 0.0745 26.5070 4.0238 36.5871 5.7633 3.6075 7.5982 13.7112 0.8613 2.5883 8.3394 3.7663 0.5784 0.6262 32.8022 0.8154 21.4423 82.9631 31.6071 28.1291 38.8414 90.9647 32.7655 4.7648 1.6989 4.5667 10.6053 21.2842 2.3606 0.1403 8.4975 1.9902 2.0641 1.0540 33.9333 1.3157 0.7365 53.2060 9.3012 48.2202 27.3132 17.0979 21.6856 17.9337 22.1592 0.0034 16.0759 16.4120 200.0419 16.5782 107.4853 156.7852 29.5861 42.9120 93.9777 282.8691 9.7377 12.0150 2.1636 0.2632 25.7699 36.3098 3.2513 120.8491 192.0411 69.1004 26.2539 13.5733 149.8057 53.1485 113.2377 34.8298 112.9685 438.8517 0.9955 1.3180 0.1835 5.1434 26.0389 20.5533 0.1311 0.9206 2.2010 1.8672 3.7523 1.1586 0.2568
temp: 298.150 k
press: 1.00000 atm
elementType: 17 16 8 8 8 7 7 6 6 6 6 6 6 6 6 6 6 6 6 6 6 6 6 6 6 6 6 1 1 1 1 1 1 1 1 1 1 1 1 1
symmnumber: 1
zpe: 739565.9 jmol-1
zpe.correction: 0.281686 hartree
zpe.thermalcorrener: 0.304468 hartree
zpe.thermalcorrenthalpy: 0.305412 hartree
zpe.thermalcorrgfe: 0.226371 hartree
zpe.sumelectzpe: -1961.367612 hartree
zpe.sumelectthermal: -1961.344829 hartree
zpe.sumelectthermalent: -1961.343885 hartree
zpe.sumelectthermalfe: -1961.422926 hartree
dipole: -1.7837 1.8671 -2.5374
dipole: 3.6202
quadrupole: -165.2403 -165.6374 -170.1975
quadrupole: 3.0030 -12.8192 -12.7475
quadrupole: 1.7848 1.3877 -3.1724 3.0030 -12.8192 -12.7475
hfenergy: -1961.6492973 hartree
pointgroup: C01 [X(C20H13Cl1N2O3S1)]
dipole: -0.9091069 -0.9707594 -0.5096692 debye
polarizability: 300.2548905|6.2507529|214.2991574|-4.4783571|-34.9379044|287.3048463 unknown
InChI: InChI=1S/C20H13ClN2O3S/c21-13-8-9-15-16(11-13)22(14-5-2-1-3-6-14)18(24)12-19(25)23(15)20(26)17-7-4-10-27-17/h1-11H,12H2
charge 0 multiplicity 1
40 atoms
Cl -1.971903 -2.589668 4.550747
S  4.406206 -0.707355 -2.116433
O  -1.624749 2.405087 -0.911787
O  2.288811 2.554006 -0.132773
O  3.527465 -0.870411 0.838037
N  -1.340352 0.425988 0.322786
N  1.559049 0.463875 0.65723
C  -0.6989 -0.260287 1.415004
C  0.715901 -0.238478 1.597543
C  0.051295 2.421278 0.868657
C  -1.053402 1.779822 0.020947
C  1.404888 1.862511 0.426491
C  -2.363148 -0.293212 -0.42354
C  -1.512484 -0.977599 2.329971
C  1.287571 -0.93015 2.696906
C  2.737868 -0.225181 0.098599
C  -0.912463 -1.671964 3.38933
C  0.482569 -1.662862 3.590299
C  -2.075138 -1.599898 -0.887807
C  -3.626094 0.292257 -0.67688
C  2.857704 -0.158846 -1.35388
C  -3.05683 -2.324727 -1.596149
C  -4.598152 -0.437163 -1.395651
C  -4.321399 -1.745859 -1.85377
C  1.926355 0.224764 -2.323864
C  2.413282 0.101373 -3.664225
C  3.719805 -0.375868 -3.726858
H  0.05096 3.500902 0.666635
H  -0.1145 2.242071 1.946449
H  -2.596856 -0.987644 2.193775
H  2.371671 -0.907131 2.82391
H  0.930814 -2.205515 4.426548
H  -1.091936 -2.04181 -0.69402
H  -3.838256 1.307141 -0.332892
H  -2.830872 -3.335843 -1.951242
H  -5.573955 0.018608 -1.594664
H  -5.081257 -2.307819 -2.407287
H  0.922372 0.580262 -2.081209
H  1.825001 0.357586 -4.547657
H  4.332063 -0.556733 -4.609275
