program: Gaussian 09
title: 000213490
version: EM64L-G09RevD.01
frameworkgroup: C1[X(C21H30O2)]
method: RPBEPBE
basis: SDD
operation: Freq
keyword: #pfreq=noraman
keyword: PBEPBE/SDD
title: #p freq=noraman PBEPBE/SDD
converged: YES YES NO NO
title: Mulliken charges:
elementType: O O C C C C C C C C C C C C C C C C C C C C C H H H H H H H H H H H H H H H H H H H H H H H H H H H H H H
charge: -0.198000 -0.213885 -0.104606 -0.147162 -0.184302 0.403807 0.268360 -0.067352 -0.513705 -0.232475 -0.556793 -0.481784 -0.469418 -0.509583 -0.255844 -0.291824 -0.591407 -0.851266 -0.790659 -0.547100 0.176383 0.155900 -0.793191 0.231303 0.223395 0.202285 0.212928 0.218597 0.206427 0.245221 0.206528 0.236247 0.206158 0.201968 0.260949 0.211110 0.224481 0.212830 0.208454 0.218515 0.230890 0.239950 0.222730 0.242473 0.219566 0.252226 0.226669 0.224600 0.245852 0.226934 0.243096 0.239169 0.254359
chargesum: 0.00000
title: Mulliken charges with hydrogens summed into heavy atoms:
elementType: O O C C C C C C C C C C C C C C C C C C C C C
charge: -0.198000 -0.213885 0.126698 0.076232 0.017982 0.403807 0.268360 0.145577 -0.088681 0.012745 -0.114018 -0.073658 0.002640 -0.072272 -0.047390 -0.073310 -0.120568 -0.166497 -0.087165 -0.074314 0.176383 0.155900 -0.056567
polarizability: 2.89996098e+02 1.41574595e+00 2.04350199e+02 -7.92259553e+00 2.51057514e+00 1.68660056e+02
1716.lowfreq: -5.7798 -0.0008 -0.0006 -0.0005 9.1139 16.0881 36.5338 47.2603 62.9171
frequency: 36.5112 47.2257 62.7831 74.3287 86.6860 103.9345 106.8360 145.9733 161.4775 170.4467 195.4026 203.0584 219.9165 227.6175 249.0668 261.3035 269.1358 273.1514 286.9075 303.4714 322.4919 343.0901 372.4155 389.0201 400.6495 417.3608 426.7835 437.1444 460.6495 498.7596 504.5762 512.4234 531.2506 555.0806 575.0555 586.2133 589.4661 643.4422 673.8019 676.3222 717.6566 753.9449 762.8874 765.9050 803.0625 811.8805 831.6288 844.9892 869.5204 905.7150 915.7633 917.9835 930.0294 943.5952 944.4190 963.3074 966.2168 975.1932 982.2943 985.9043 1000.0654 1012.4989 1021.8079 1026.3102 1037.0010 1054.5744 1066.3446 1074.8151 1089.5914 1108.3821 1118.2017 1124.2372 1127.9742 1138.7515 1153.1107 1154.8871 1164.7658 1180.5536 1190.3243 1199.9612 1211.1424 1215.0874 1220.7857 1229.5107 1234.2000 1254.1073 1255.3598 1258.3956 1265.1029 1275.1747 1288.7286 1289.1260 1300.6896 1307.1378 1320.4847 1322.7399 1328.8437 1336.3753 1339.0418 1342.7753 1351.5645 1352.6782 1364.1814 1379.1519 1384.0796 1396.5766 1401.9929 1439.6668 1442.6237 1448.0321 1451.0936 1461.9059 1465.2932 1469.1611 1470.6120 1477.0352 1479.5510 1487.4857 1493.1048 1499.6039 1621.0055 1630.9870 1641.9281 2877.3136 2918.8937 2924.4408 2955.4518 2966.9405 2969.8723 2971.2222 2975.0504 2977.5240 2983.8168 2987.9803 2989.9994 2990.7422 2997.4653 3014.4142 3021.5044 3032.9248 3036.1787 3053.3002 3057.6001 3062.0941 3065.4092 3073.2482 3075.1795 3077.9832 3079.8112 3082.9851 3096.4854 3111.9164 3118.9778
redmass: 6.6241 3.8094 5.2363 3.8358 3.1727 1.1636 3.1977 2.1070 3.7665 2.5228 2.1323 2.6201 2.2927 1.6863 1.5072 2.4826 2.2336 2.4022 2.4576 2.8278 3.0860 3.4177 2.9092 2.8965 2.9506 2.8117 3.1020 2.8990 2.9624 3.0145 2.8596 2.8255 3.3225 2.6623 3.0907 2.8820 3.1978 3.9115 3.1723 2.2192 2.0738 1.8873 3.5931 2.0602 2.7466 2.1275 2.0540 1.8171 1.8631 1.9793 3.2809 1.8811 2.1319 1.6633 1.7527 1.8513 1.6128 1.7760 1.9140 1.9733 2.2013 2.1141 2.1852 2.0075 2.0184 2.2580 2.3862 1.8928 2.3749 1.8285 2.1224 1.7810 1.7759 2.1688 1.5868 1.9922 1.8928 2.4413 2.1192 1.6666 1.2881 1.6913 1.6578 1.5479 1.2744 1.5706 1.4357 1.6217 1.4610 1.3710 1.4313 1.5274 1.3776 1.3587 1.3565 1.5583 1.3917 1.5098 1.4756 1.5176 1.4011 1.4583 1.2535 1.3988 1.4392 1.2152 1.2586 1.0840 1.0727 1.0818 1.0567 1.0619 1.0868 1.0870 1.0877 1.0730 1.0626 1.0567 1.0828 1.0533 7.2696 9.3770 7.9497 1.0797 1.0813 1.0818 1.0641 1.0620 1.0632 1.0629 1.0634 1.0391 1.0713 1.0411 1.0653 1.0567 1.0609 1.0638 1.0976 1.1005 1.0989 1.1013 1.0965 1.0938 1.0958 1.0973 1.0973 1.0852 1.1028 1.0972 1.0998 1.0959 1.1008
irintensity: 3.4833 3.8250 1.3363 3.2528 0.3712 0.3697 2.6581 0.6066 0.6438 0.2718 0.1010 0.0768 0.8755 0.4848 0.2503 5.9831 0.2303 0.1722 0.1265 2.0213 1.5781 0.5732 0.6754 1.3578 0.8185 0.6821 2.1284 3.8951 1.4031 4.8163 1.9384 1.6380 2.9425 4.9496 2.4974 3.6181 4.4309 1.6538 3.3117 5.5084 17.8659 12.5914 1.9616 5.9440 0.5281 2.0138 8.7928 1.8224 3.0239 3.9594 4.3900 0.3618 0.3158 5.6157 3.6460 14.9457 3.7699 6.5707 5.7493 1.3417 4.3201 2.6827 3.1114 6.0975 1.1890 3.4576 21.2790 2.9355 4.8685 10.9365 0.6909 5.7025 9.5155 12.5809 13.2299 0.3866 20.6191 64.6704 1.8316 41.0384 12.9455 40.8869 2.9857 1.8152 5.8720 4.7135 0.3393 16.6104 3.9873 7.1746 9.4601 4.8485 0.1322 3.5919 1.3895 0.5668 0.4918 29.8770 0.6369 12.1555 2.6840 0.5744 67.3664 6.6632 7.8548 27.5603 11.3132 19.0576 17.3681 11.4223 13.4511 10.1955 14.0752 7.8033 15.4485 3.6237 5.0023 7.2984 10.2906 5.6591 120.9232 218.3053 4.7734 16.9888 13.7781 19.1127 22.2376 12.6473 31.8186 9.8916 49.4539 1.6511 4.6185 4.3210 55.7200 12.7248 36.5827 32.0651 42.4806 47.2675 45.4139 22.3513 26.7154 10.0356 26.7801 32.7189 13.2737 15.2392 38.4534 36.3423 24.8272 48.4248 15.9087
temp: 298.150 k
press: 1.00000 atm
elementType: 8 8 6 6 6 6 6 6 6 6 6 6 6 6 6 6 6 6 6 6 6 6 6 1 1 1 1 1 1 1 1 1 1 1 1 1 1 1 1 1 1 1 1 1 1 1 1 1 1 1 1 1 1
symmnumber: 1
zpe: 1212942.4 jmol-1
zpe.correction: 0.461985 hartree
zpe.thermalcorrener: 0.483999 hartree
zpe.thermalcorrenthalpy: 0.484944 hartree
zpe.thermalcorrgfe: 0.412628 hartree
zpe.sumelectzpe: -966.900198 hartree
zpe.sumelectthermal: -966.878184 hartree
zpe.sumelectthermalent: -966.877239 hartree
zpe.sumelectthermalfe: -966.949555 hartree
dipole: -1.2384 -0.6983 -0.5451
dipole: 1.5226
quadrupole: -192.6922 -132.4537 -139.3838
quadrupole: 5.2741 20.2162 0.1499
quadrupole: -37.8490 22.3895 15.4594 5.2741 20.2162 0.1499
hfenergy: -967.362183 hartree
pointgroup: C01 [X(C21H30O2)]
dipole: 0.4860649 0.2720722 -0.2204098 debye
polarizability: 289.9929706|1.9046021|204.244101|7.8255223|-3.2191733|168.7692814 unknown
InChI: InChI=1S/C21H30O2/c1-13(22)17-6-7-18-16-5-4-14-12-15(23)8-10-20(14,2)19(16)9-11-21(17,18)3/h9,11,14,16-19H,4-8,10,12H2,1-3H3
charge 0 multiplicity 1
53 atoms
O  -6.245174 0.32141 -0.781102
O  5.627926 0.256457 0.763193
C  0.043263 -1.00463 0.136844
C  1.478204 -0.987674 -0.420171
C  -0.681391 0.2743 -0.396206
C  -2.122377 0.440603 0.223695
C  2.312325 0.206438 0.152672
C  -2.915299 -0.867893 -0.139577
C  -0.772035 -2.265575 -0.223989
C  3.65935 -0.033238 -0.659066
C  2.42557 -2.196539 -0.267835
C  -2.212742 -2.164017 0.329434
C  3.830733 -1.592428 -0.615502
C  -2.864445 1.629774 -0.463321
C  0.204993 1.513394 -0.300523
C  1.552078 1.495423 -0.101355
C  -4.392197 -0.813756 0.339071
C  -2.033708 0.69242 1.752436
C  2.598861 0.100102 1.681316
C  -4.371272 1.731771 -0.093662
C  -5.115216 0.404339 -0.228149
C  4.870337 0.735206 -0.125952
C  5.136928 2.111694 -0.725604
H  0.096582 -0.949714 1.243119
H  1.388669 -0.794591 -1.514262
H  -0.856949 0.097783 -1.48663
H  -2.938671 -0.906171 -1.25309
H  -0.27435 -3.168524 0.178763
H  -0.805278 -2.382275 -1.328258
H  3.468658 0.306895 -1.696642
H  2.156081 -3.029974 -0.940165
H  2.407128 -2.59028 0.765608
H  -2.808771 -3.038136 0.000126
H  -2.189776 -2.200985 1.437888
H  4.589876 -1.856264 0.140866
H  4.195913 -1.959586 -1.591309
H  -2.772589 1.51675 -1.563298
H  -2.38348 2.590256 -0.198888
H  -0.28395 2.485921 -0.450239
H  2.097909 2.448045 -0.040381
H  -4.42033 -0.76512 1.447714
H  -4.940684 -1.723517 0.035406
H  -1.648019 -0.183925 2.301562
H  -1.350836 1.537847 1.95637
H  -3.0156 0.944404 2.190334
H  3.263751 -0.745876 1.924694
H  3.100805 1.016941 2.04036
H  1.660043 -0.002802 2.252209
H  -4.882317 2.487562 -0.715425
H  -4.468288 2.061113 0.961862
H  5.547747 1.988872 -1.747601
H  4.205611 2.697546 -0.828619
H  5.869804 2.662522 -0.115423
