program: Gaussian 09
title: 000213431
version: EM64L-G09RevD.01
frameworkgroup: C1[X(C18H20ClNO2)]
method: RPBEPBE
basis: SDD
operation: Freq
keyword: #p
keyword: freq=noraman
keyword: PBEPBE/SDD
title: #p freq=noraman PBEPBE/SDD
converged: YES YES NO NO
title: Mulliken charges:
elementType: Cl O O N C C C C C C C C C C C C C C C C C C H H H H H H H H H H H H H H H H H H H H
charge: -0.072657 -0.260859 -0.300346 -0.075792 -0.444270 -0.429139 -0.442685 -0.438016 -0.361747 -0.305776 0.269694 0.153302 -0.339234 -0.337027 -0.239825 -0.230014 0.388624 -0.317985 -0.372961 -0.205716 -0.182483 -0.118185 0.215165 0.236004 0.210459 0.235650 0.219048 0.226241 0.226337 0.222319 0.210806 0.225023 0.223833 0.214887 0.256067 0.257439 0.227330 0.231691 0.258714 0.259130 0.252243 0.254711
chargesum: 0.00000
title: Mulliken charges with hydrogens summed into heavy atoms:
elementType: Cl O O N C C C C C C C C C C C C C C C C C C
charge: -0.072657 -0.260859 -0.300346 -0.075792 0.006899 0.016970 0.002604 0.010640 0.074081 0.132944 0.269694 0.153302 -0.083167 -0.079588 -0.012495 0.001678 0.388624 -0.059271 -0.113830 0.046526 0.072227 -0.118185
polarizability: 1.97470629e+02 -2.76284955e+00 2.83654881e+02 -8.36701535e+00 -7.97460895e+00 1.66555190e+02
1716.lowfreq: -24.3385 -6.6842 -5.1397 -0.0005 0.0017 0.0020 5.4088 11.9848 25.4579
frequency: -21.2546 10.1865 25.3460 35.6888 48.1935 62.5398 67.8456 89.5317 98.6845 126.9277 144.4263 165.3005 193.0735 214.5741 258.1923 280.8436 301.7707 316.4904 350.5494 389.4772 412.2792 414.0983 420.1326 456.3668 489.5784 506.8034 540.4199 568.0197 599.4207 607.9552 621.0569 632.3205 655.6778 690.5597 719.3777 741.1993 753.0357 765.1675 790.0489 809.0504 818.6609 822.8021 830.0704 846.9234 856.5935 860.6342 877.2583 907.3294 926.6379 934.1422 935.0614 950.9707 966.9284 969.1156 992.4309 1021.5813 1034.5473 1036.6605 1056.4133 1067.2905 1076.9203 1095.4810 1099.7290 1103.4314 1135.0322 1159.1296 1166.5193 1168.6258 1174.2066 1183.2090 1202.1850 1216.0969 1227.6101 1249.2477 1259.2026 1268.0088 1284.7230 1286.7118 1291.2089 1298.6206 1312.7196 1317.7068 1327.9926 1371.4880 1376.5277 1390.6276 1401.8528 1435.6876 1460.7488 1465.5809 1466.5625 1471.7595 1473.5196 1480.7162 1486.5583 1488.8972 1583.4877 1590.6496 1597.6733 1610.9299 2924.7824 2966.9156 2985.3622 2995.4411 3005.2124 3019.3313 3032.9348 3052.9247 3059.8230 3069.2823 3078.1896 3090.4294 3136.9405 3152.6395 3154.1076 3160.2719 3164.6316 3173.5147 3176.0760 3180.1445
redmass: 3.3242 7.1099 3.7316 4.0980 4.4818 3.7460 3.1759 2.2724 5.5561 3.8127 2.1987 5.7186 6.3077 6.9553 3.9842 5.4501 5.7882 5.0594 4.4162 3.0729 4.0684 3.1016 2.6444 3.8352 2.8620 4.3137 4.5869 6.6154 5.4866 2.2207 7.0716 6.2741 3.9545 3.6848 4.5661 3.1410 1.4126 1.9747 2.7428 1.2605 1.2163 1.5668 2.5258 1.4581 4.9656 2.1809 3.6002 2.5234 1.3749 1.5511 1.3348 1.3455 6.7548 1.3461 4.0719 2.7529 2.3476 2.0733 2.0242 2.6229 1.7831 2.3851 2.7095 1.3036 1.7006 1.6262 1.1676 1.2726 1.4450 1.2180 3.1180 1.2867 1.3784 3.5226 1.3174 1.5249 1.2525 1.2995 1.1351 1.3191 1.2231 1.5603 1.2930 5.7301 3.5971 1.8671 3.9411 2.3707 1.1008 1.0969 2.3047 1.0887 1.3111 1.1814 1.6512 1.0976 6.7542 7.5248 7.0579 6.9963 1.0681 1.0569 1.0662 1.0624 1.0594 1.0644 1.0998 1.1017 1.1008 1.1020 1.1005 1.1058 1.0856 1.0899 1.0882 1.0885 1.0940 1.0968 1.1003 1.0977
irintensity: 0.2372 0.0564 0.1670 0.2618 0.5536 0.5134 0.0872 0.5819 0.5533 0.9351 3.1533 1.0906 0.4697 0.5152 2.4659 1.2667 0.0039 0.9436 8.1139 4.1720 4.9443 0.3325 4.9280 14.7054 21.7134 0.9678 4.5573 5.0096 1.8216 5.2932 8.2003 9.4874 7.3736 1.9438 6.0596 28.7046 93.2116 12.7570 9.6363 2.4941 0.0081 81.4229 1.5604 0.2735 11.7544 7.4819 11.2352 3.1244 2.7526 10.9821 0.0923 0.2973 90.8576 3.9723 42.9566 16.1668 19.3614 13.4242 42.6089 51.5517 13.6750 72.8111 6.0721 15.4445 2.5575 13.4169 32.3204 3.3246 14.6684 1.5728 180.9963 5.1245 5.4340 336.8518 21.4514 17.6285 0.2871 4.9117 2.8379 4.7972 1.5000 11.3115 1.4553 5.9767 8.4883 5.9422 1.6744 30.2056 11.1838 3.5441 227.5747 10.8143 143.6477 17.8924 65.0587 3.8256 17.5850 7.7535 18.1597 30.4159 40.4219 38.4403 51.6840 36.0137 43.5039 48.7596 8.6163 15.0779 32.2838 3.1802 29.4395 106.4237 1.8893 16.3978 4.0512 2.5910 16.8526 4.1747 13.0380 1.8063
temp: 298.150 k
press: 1.00000 atm
elementType: 17 8 8 7 6 6 6 6 6 6 6 6 6 6 6 6 6 6 6 6 6 6 1 1 1 1 1 1 1 1 1 1 1 1 1 1 1 1 1 1 1 1
symmnumber: 1
zpe: 889547.9 jmol-1
zpe.correction: 0.338811 hartree
zpe.thermalcorrener: 0.358565 hartree
zpe.thermalcorrenthalpy: 0.359509 hartree
zpe.thermalcorrgfe: 0.286801 hartree
zpe.sumelectzpe: -1361.511697 hartree
zpe.sumelectthermal: -1361.491943 hartree
zpe.sumelectthermalent: -1361.490999 hartree
zpe.sumelectthermalfe: -1361.563707 hartree
dipole: 2.9947 1.8436 -0.3038
dipole: 3.5297
quadrupole: -131.0433 -135.3991 -134.5103
quadrupole: -9.2569 0.6784 -6.9607
quadrupole: 2.6076 -1.7482 -0.8594 -9.2569 0.6784 -6.9607
hfenergy: -1361.8505082 hartree
pointgroup: C01 [X(C18H20Cl1N1O2)]
dipole: -0.5898238 -1.245911 -0.168211 debye
polarizability: 225.1571438|-40.9417819|255.2333471|4.0679067|11.5427834|167.2902079 unknown
InChI: InChI=1S/C18H20ClNO2/c19-15-7-9-16(10-8-15)22-18-6-2-1-5-17(18)21-14-13-20-11-3-4-12-20/h1-2,5-10H,3-4,11-14H2
charge 0 multiplicity 1
42 atoms
Cl 0.119016 5.649721 -0.667917
O  0.134813 -0.909231 0.062328
O  2.196795 0.376755 1.399259
N  -3.434827 -1.517293 -0.820957
C  -4.570186 -0.637449 -1.221409
C  -4.054781 -2.465431 0.155936
C  -5.373639 -0.360829 0.087597
C  -5.190852 -1.675116 0.912088
C  -2.251995 -0.794841 -0.281946
C  -0.992198 -1.619506 -0.574783
C  1.412822 -1.451109 -0.076601
C  2.468408 -0.743981 0.572162
C  1.721498 -2.630984 -0.797249
C  3.789787 -1.219863 0.517804
C  3.05431 -3.100569 -0.854027
C  4.09075 -2.403308 -0.19682
C  1.690435 1.570516 0.837751
C  1.68415 1.84481 -0.548874
C  1.228757 2.528687 1.768501
C  1.202828 3.091387 -1.007603
C  0.749674 3.774039 1.312089
C  0.74179 4.036956 -0.072572
H  -5.20363 -1.191598 -1.941544
H  -4.203716 0.273652 -1.72291
H  -3.288122 -2.868103 0.840807
H  -4.490755 -3.316985 -0.398972
H  -6.434174 -0.127028 -0.110639
H  -4.932901 0.499214 0.623979
H  -4.909727 -1.457242 1.957005
H  -6.121947 -2.268595 0.938594
H  -2.308183 -0.594988 0.812351
H  -2.159743 0.183107 -0.786982
H  -0.834357 -1.696954 -1.667721
H  -1.077215 -2.640816 -0.150622
H  0.929659 -3.190122 -1.30405
H  4.565268 -0.655672 1.045084
H  3.275531 -4.016888 -1.411866
H  5.120841 -2.770804 -0.236834
H  2.049082 1.102315 -1.264706
H  1.248289 2.287928 2.835068
H  1.192114 3.318926 -2.077481
H  0.388734 4.523792 2.021782
