program: Gaussian 09
title: 000213439
version: EM64L-G09RevD.01
frameworkgroup: C1[X(C20H24ClNO2)]
method: RPBEPBE
basis: SDD
operation: Freq
keyword: #p
keyword: freq=noraman
keyword: PBEPBE/SDD
title: #p freq=noraman PBEPBE/SDD
converged: YES YES NO NO
title: Mulliken charges:
elementType: Cl O O N C C C C C C C C C C C C C C C C C C C C H H H H H H H H H H H H H H H H H H H H H H H H
charge: -0.071693 -0.266132 -0.299158 -0.095480 -0.354668 -0.366773 -0.393094 -0.391537 -0.398604 -0.341386 -0.443394 -0.286363 0.277674 0.142943 -0.339347 -0.335889 -0.238462 -0.231949 0.386320 -0.330426 -0.373158 -0.198795 -0.181583 -0.128950 0.202350 0.172554 0.172411 0.225178 0.199178 0.191968 0.199860 0.192674 0.213551 0.191063 0.239082 0.192986 0.223509 0.195328 0.210237 0.236400 0.255448 0.257129 0.226083 0.231048 0.263441 0.260377 0.253049 0.255003
chargesum: 0.00000
title: Mulliken charges with hydrogens summed into heavy atoms:
elementType: Cl O O N C C C C C C C C C C C C C C C C C C C C
charge: -0.071693 -0.266132 -0.299158 -0.095480 0.020236 0.030816 -0.001949 0.000997 0.006011 0.090681 -0.024557 0.160275 0.277674 0.142943 -0.083900 -0.078760 -0.012379 -0.000901 0.386320 -0.066985 -0.112781 0.054254 0.073419 -0.128950
polarizability: 2.47788847e+02 3.12153237e+01 2.67491238e+02 5.53854825e+00 2.09426818e+01 1.90737916e+02
1716.lowfreq: -17.2731 -8.3679 -5.3718 0.0018 0.0019 0.0020 11.1932 18.2943 20.7288
frequency: -12.3543 17.9415 20.6032 33.8699 42.2839 60.0399 64.9488 84.7675 104.3362 122.9204 163.4566 182.1574 194.7974 222.2403 234.2241 265.7318 279.0399 287.4540 311.5132 326.7213 333.9463 366.8903 389.9657 400.4278 414.3493 415.2306 448.5668 455.5199 486.3387 490.9357 499.9683 534.1475 541.0603 583.3316 599.9486 621.0113 632.6042 689.5048 712.1045 722.9120 745.9199 758.2503 773.7237 802.7433 810.4745 822.4532 824.0395 843.3863 845.9631 849.4447 860.2744 890.6825 905.4171 926.6445 934.4737 935.8268 951.5506 957.9165 968.4232 981.6695 992.1469 1018.0423 1035.6325 1040.7948 1057.2332 1067.0828 1081.1968 1094.1490 1102.1986 1109.8658 1117.0142 1122.7857 1148.9828 1153.9791 1158.2749 1165.7661 1172.8615 1182.9635 1200.8328 1206.8077 1247.0468 1256.5464 1264.5605 1265.9631 1269.8378 1283.0705 1288.8979 1292.4435 1327.8469 1338.8446 1340.0154 1347.4440 1350.1005 1364.3338 1367.8082 1372.1349 1381.0402 1390.5347 1401.4521 1434.9994 1446.2333 1451.1962 1459.3086 1461.6257 1462.5173 1465.9678 1466.6274 1473.2466 1483.8637 1487.4494 1581.7439 1589.0919 1597.3651 1611.0477 2823.0981 2834.7300 2873.4952 2964.6382 2966.9975 2982.4724 2983.1448 2999.2769 3025.9784 3028.4738 3034.2923 3035.5931 3043.1960 3044.1955 3052.4601 3061.2273 3135.8713 3151.0019 3152.0540 3160.2609 3164.8906 3170.0056 3175.7100 3179.9509
redmass: 4.1556 6.9501 4.9329 3.3326 3.8021 5.2345 4.7361 5.3823 3.6019 6.0983 5.0154 4.1841 2.3095 4.6204 2.1485 5.0859 5.6645 2.3256 4.1409 2.5208 6.3770 2.7517 2.2396 3.3536 3.0225 2.9818 2.8458 3.9691 3.2702 3.6492 2.6268 2.2045 2.9796 4.7952 5.9818 7.0299 6.3131 3.7290 2.7989 3.9366 2.4970 1.7153 3.8763 1.4720 1.2554 1.9925 1.7532 1.8883 2.3570 1.5780 2.7305 2.6862 2.3057 1.3852 2.4163 1.5039 1.3437 1.3086 1.3082 2.2013 4.0261 2.0501 2.0381 2.0492 1.8476 2.6097 1.6141 2.4357 1.3004 2.0546 2.2256 2.6712 1.3419 2.0572 1.5660 1.1780 1.4830 1.2736 2.3385 1.3355 3.2101 1.3994 1.3446 1.3588 1.4371 1.2538 1.1812 1.4165 1.2742 1.4030 1.4525 1.5172 1.3726 1.7236 1.4607 5.0984 3.4166 1.5130 3.9813 2.3458 1.0921 1.0912 1.0866 1.1207 1.2651 2.1599 1.1314 1.0863 1.1946 1.7632 6.7601 7.5465 6.9957 6.9718 1.0712 1.0701 1.0709 1.0552 1.0624 1.0617 1.0608 1.0625 1.0862 1.0913 1.1022 1.0947 1.1030 1.0930 1.1037 1.0988 1.0857 1.0881 1.0900 1.0885 1.0940 1.0969 1.1002 1.0976
irintensity: 0.1139 0.1976 0.0142 0.3073 0.2040 0.8290 0.1215 0.0975 0.6201 1.1578 1.7050 0.2345 5.9620 0.5574 0.3067 0.6899 0.3003 5.1705 3.1913 1.3513 6.0813 1.1133 1.0261 7.0669 1.1735 0.5468 0.3199 14.6917 11.2242 13.3039 0.9228 2.8640 1.7637 0.8022 2.0614 8.3878 7.9776 1.4469 25.1899 1.7666 45.4596 64.4748 3.2057 0.1144 3.8920 24.8780 65.2075 3.4659 3.9432 9.4287 2.5416 0.3553 1.0278 5.1073 67.2971 17.5946 0.3920 1.5132 0.1125 15.5622 38.6826 13.6836 19.3563 8.9003 6.1096 50.2947 11.6383 69.8942 16.5909 8.8600 14.7525 5.8932 9.9371 24.0280 10.4813 25.4764 15.0723 3.6015 102.6590 70.0151 305.8932 17.4560 10.3838 8.3596 13.4660 0.5588 7.9615 9.2847 6.1240 0.2629 5.2165 2.7164 2.2987 9.4336 3.0502 2.1919 10.5716 3.2244 1.3041 24.6323 17.9701 5.7887 12.4230 22.3625 41.8477 275.6791 44.8371 3.0340 40.3421 46.3797 11.5526 7.7753 15.8886 31.3317 65.0590 95.8316 122.3949 32.4504 38.6324 31.9319 31.7373 23.9422 65.5628 61.6051 26.1814 15.4648 25.3331 27.2717 96.7101 41.9289 2.2748 5.0381 14.4527 2.5581 16.8557 4.3048 12.9814 2.1990
temp: 298.150 k
press: 1.00000 atm
elementType: 17 8 8 7 6 6 6 6 6 6 6 6 6 6 6 6 6 6 6 6 6 6 6 6 1 1 1 1 1 1 1 1 1 1 1 1 1 1 1 1 1 1 1 1 1 1 1 1
symmnumber: 1
zpe: 1038603.3 jmol-1
zpe.correction: 0.395583 hartree
zpe.thermalcorrener: 0.417209 hartree
zpe.thermalcorrenthalpy: 0.418153 hartree
zpe.thermalcorrgfe: 0.342631 hartree
zpe.sumelectzpe: -1439.969117 hartree
zpe.sumelectthermal: -1439.947491 hartree
zpe.sumelectthermalent: -1439.946547 hartree
zpe.sumelectthermalfe: -1440.022069 hartree
dipole: 1.4468 -3.1265 0.0129
dipole: 3.4451
quadrupole: -145.4444 -150.6308 -144.4342
quadrupole: -2.0866 4.8406 4.6273
quadrupole: 1.3921 -3.7943 2.4022 -2.0866 4.8406 4.6273
hfenergy: -1440.3647004 hartree
pointgroup: C01 [X(C20H24Cl1N1O2)]
dipole: -0.0008234 1.1879669 -0.6525416 debye
polarizability: 270.9817035|11.5427722|212.9290184|-32.2965505|-29.7074398|222.1072797 unknown
InChI: InChI=1S/C20H24ClNO2/c21-17-9-11-18(12-10-17)24-20-8-3-2-7-19(20)23-16-6-15-22-13-4-1-5-14-22/h2-3,7-12H,1,4-6,13-16H2
charge 0 multiplicity 1
48 atoms
Cl -2.719763 -3.950105 2.089808
O  1.380403 1.009424 0.589016
O  2.660238 -1.353499 1.244282
N  -2.225338 1.788973 -0.109975
C  -3.13813 2.960011 -0.069761
C  -2.929137 0.578271 -0.609715
C  -3.709448 3.272417 -1.468307
C  -3.48589 0.810484 -2.029089
C  -4.428571 2.035757 -2.054058
C  -1.52935 1.55779 1.181738
C  -0.333499 2.517387 1.381464
C  0.746534 2.323131 0.318223
C  2.391446 0.583922 -0.269878
C  3.008322 -0.661876 0.05286
C  2.843855 1.292453 -1.41066
C  4.058834 -1.169842 -0.729916
C  3.896562 0.772785 -2.199334
C  4.510629 -0.453022 -1.863468
C  1.373637 -1.921312 1.373383
C  0.501716 -2.136584 0.281298
C  1.013523 -2.327639 2.67859
C  -0.748047 -2.757873 0.50168
C  -0.233293 -2.94878 2.899658
C  -1.099368 -3.152678 1.806217
H  -2.582092 3.835897 0.312463
H  -3.988359 2.774642 0.640635
H  -3.773607 0.288463 0.070655
H  -2.209649 -0.261007 -0.612188
H  -2.876961 3.568268 -2.136357
H  -4.404629 4.131432 -1.398087
H  -2.637691 0.982108 -2.720408
H  -4.018809 -0.098522 -2.369074
H  -4.774841 2.239636 -3.085057
H  -5.331309 1.814724 -1.44725
H  -1.144808 0.521819 1.187068
H  -2.227317 1.651726 2.050591
H  0.106033 2.355631 2.383895
H  -0.67208 3.571066 1.34074
H  1.523353 3.112255 0.371952
H  0.279091 2.310629 -0.686307
H  2.38594 2.247895 -1.681346
H  4.513798 -2.120215 -0.433796
H  4.236708 1.3353 -3.075607
H  5.33007 -0.850128 -2.470607
H  0.790138 -1.828119 -0.72808
H  1.709323 -2.149289 3.503159
H  -1.430686 -2.93623 -0.334665
H  -0.524781 -3.265278 3.905218
