program: Gaussian 09
title: 000213433
version: EM64L-G09RevD.01
frameworkgroup: C1[X(C19H22ClNO2)]
method: RPBEPBE
basis: SDD
operation: Freq
keyword: #p
keyword: freq=noraman
keyword: PBEPBE/SDD
title: #p freq=noraman PBEPBE/SDD
converged: YES YES NO NO
title: Mulliken charges:
elementType: Cl O O N C C C C C C C C C C C C C C C C C C C H H H H H H H H H H H H H H H H H H H H H H
charge: -0.072392 -0.261823 -0.300298 -0.084621 -0.367536 -0.373495 -0.389902 -0.385276 -0.399522 -0.374015 -0.307044 0.269071 0.154141 -0.338546 -0.338039 -0.239684 -0.229696 0.390617 -0.318837 -0.372958 -0.205113 -0.182233 -0.118495 0.180220 0.205481 0.214605 0.172019 0.193378 0.203619 0.202942 0.194445 0.215429 0.190893 0.211320 0.226605 0.221639 0.216856 0.255126 0.257582 0.227231 0.231686 0.258604 0.259237 0.252133 0.254648
chargesum: 0.00000
title: Mulliken charges with hydrogens summed into heavy atoms:
elementType: Cl O O N C C C C C C C C C C C C C C C C C C C
charge: -0.072392 -0.261823 -0.300298 -0.084621 0.018165 0.013130 0.007094 0.012111 0.006801 0.063910 0.131450 0.269071 0.154141 -0.083419 -0.080457 -0.012453 0.001990 0.390617 -0.060233 -0.113721 0.047020 0.072415 -0.118495
polarizability: 2.18650713e+02 -3.44901788e+00 2.91070370e+02 -1.05933363e+01 -9.54180319e+00 1.73972124e+02
1716.lowfreq: -4.7047 -2.7779 -0.0017 0.0011 0.0014 8.0997 10.8354 24.7092 34.1762
frequency: 10.6729 24.6636 33.8238 39.3779 47.3066 63.8124 80.7966 87.7455 127.4807 148.7399 164.0958 178.2400 211.7192 234.2328 250.4672 278.1528 281.3137 313.8621 317.6306 337.1448 375.2843 400.1924 402.0679 414.0407 446.8864 451.3112 456.3964 489.4806 511.0031 536.0732 549.1719 586.8765 600.5877 621.4887 633.1953 690.6213 719.1530 738.6132 751.7011 763.8890 795.2350 806.4530 809.1040 817.4852 822.7582 847.7173 853.1111 858.4266 858.7788 905.1507 927.4179 935.2387 950.6245 961.3559 967.8612 969.2690 992.4298 996.0250 1036.6763 1044.0690 1048.9405 1067.7044 1089.2260 1095.4480 1100.3595 1103.2027 1113.0069 1125.9688 1150.2730 1158.3384 1161.2892 1166.6847 1174.3944 1175.7243 1202.2577 1248.8286 1254.3462 1261.8981 1266.3168 1269.1858 1284.0372 1287.1771 1295.0670 1321.4499 1333.3001 1341.8648 1348.9656 1356.3155 1369.5856 1372.4919 1381.0376 1398.8794 1402.1776 1435.5997 1454.1878 1463.4207 1464.8903 1467.0776 1469.8635 1470.9394 1478.8448 1483.2376 1488.0110 1583.6350 1590.8932 1597.4903 1611.2407 2829.5760 2838.7273 2912.0194 2968.5730 2971.0864 2986.1769 2986.5935 3022.1810 3028.2069 3033.2255 3036.4812 3047.0292 3055.7718 3058.9924 3136.5075 3152.4462 3154.3479 3160.3144 3164.4451 3174.0367 3175.8896 3180.2380
redmass: 8.0421 4.0455 3.5259 3.7884 4.0578 5.4397 3.9503 6.0290 4.5998 2.2168 5.4049 5.2449 5.2545 2.6119 2.5019 5.8268 4.3219 4.8693 3.6765 3.1864 2.1374 5.9493 2.8128 3.0065 3.4487 3.0761 3.7395 2.8812 4.1677 3.0402 3.3370 3.4252 5.7605 7.0972 6.3342 3.6875 4.6697 3.9859 1.6348 2.5838 3.0563 1.6596 1.2682 1.2760 1.5845 1.4740 3.2245 3.2097 1.5843 2.2270 1.3734 1.3306 1.3464 1.3132 6.5177 1.3446 4.0378 2.4671 2.0365 1.8213 2.0263 2.6141 2.8835 2.3991 1.5602 1.3021 2.0698 2.1110 1.3084 1.6019 2.2721 1.1619 1.4371 1.2181 3.1151 3.0521 1.8288 1.2796 1.1878 1.5158 1.2538 1.2021 1.3926 1.3426 1.3158 1.4088 1.4869 1.4216 2.0046 3.3848 3.9677 1.5380 3.9381 2.3635 1.0905 1.0882 1.1069 2.3146 1.1577 1.1463 1.2985 1.1405 1.5388 6.7800 7.5784 7.0055 6.9970 1.0715 1.0699 1.0693 1.0626 1.0562 1.0629 1.0602 1.0872 1.0907 1.0990 1.0945 1.1033 1.1036 1.0993 1.0856 1.0899 1.0882 1.0885 1.0940 1.0968 1.1002 1.0977
irintensity: 0.0949 0.0653 0.0181 0.2563 0.4987 0.5801 0.5186 0.0492 1.6232 3.1186 0.6486 0.7163 0.9367 0.9401 1.2507 1.3030 0.7358 0.5467 1.5603 3.0322 6.0610 7.9838 6.4870 0.4159 1.4213 3.9147 9.9588 22.4804 1.9334 3.3269 3.0735 1.0160 2.3688 8.2055 9.1432 2.0825 6.1987 24.5967 85.7956 21.5162 5.1124 0.6832 1.3738 0.5527 81.4676 0.5861 4.8780 4.6386 11.2744 1.9123 2.7062 0.1006 0.2426 3.5373 100.6847 4.3793 41.9721 29.1274 22.7615 20.0725 7.6833 52.2332 0.4566 68.4331 11.3250 16.1696 22.1774 3.3410 4.8788 14.3347 31.5323 31.0809 15.5681 5.2987 183.9958 288.7290 61.7284 1.7309 8.4614 17.0605 0.4616 9.1839 11.0121 7.1745 0.6102 0.4207 2.4647 0.3315 7.6128 3.3917 8.6058 5.3715 1.3972 31.2607 7.1832 15.0772 1.7243 224.1277 42.4554 67.5166 71.6181 29.1158 43.3855 17.3408 7.0023 19.8899 30.2759 41.4084 142.7495 60.7932 38.2984 41.5010 25.9139 36.6370 63.0202 49.1126 13.4751 30.2271 20.5264 91.6234 54.3803 1.7902 16.5241 4.3399 2.5972 17.4027 4.3831 12.7515 1.6446
temp: 298.150 k
press: 1.00000 atm
elementType: 17 8 8 7 6 6 6 6 6 6 6 6 6 6 6 6 6 6 6 6 6 6 6 1 1 1 1 1 1 1 1 1 1 1 1 1 1 1 1 1 1 1 1 1 1
symmnumber: 1
zpe: 965281.4 jmol-1
zpe.correction: 0.367656 hartree
zpe.thermalcorrener: 0.389033 hartree
zpe.thermalcorrenthalpy: 0.389977 hartree
zpe.thermalcorrgfe: 0.313808 hartree
zpe.sumelectzpe: -1400.742334 hartree
zpe.sumelectthermal: -1400.720958 hartree
zpe.sumelectthermalent: -1400.720013 hartree
zpe.sumelectthermalfe: -1400.796182 hartree
dipole: 3.0453 2.0508 -0.5563
dipole: 3.7134
quadrupole: -139.7217 -143.1500 -139.8110
quadrupole: -8.2972 0.4041 -7.3234
quadrupole: 1.1725 -2.2558 1.0832 -8.2972 0.4041 -7.3234
hfenergy: -1401.1099901 hartree
pointgroup: C01 [X(C19H22Cl1N1O2)]
dipole: 0.7580547 -1.2140553 0.292916 debye
polarizability: 233.1206477|29.9045123|274.9098623|5.5037302|-17.3136036|175.6626965 unknown
InChI: InChI=1S/C19H22ClNO2/c20-16-8-10-17(11-9-16)23-19-7-3-2-6-18(19)22-15-14-21-12-4-1-5-13-21/h2-3,6-11H,1,4-5,12-15H2
charge 0 multiplicity 1
45 atoms
Cl -1.130307 5.742716 0.381685
O  -0.40252 -0.737706 -0.194685
O  -2.791739 0.181356 -1.263343
N  3.306876 -0.750991 0.183269
C  3.869475 -1.640106 -0.866091
C  4.266633 0.315991 0.567717
C  5.171702 -2.31184 -0.385828
C  5.580309 -0.295321 1.096343
C  6.204572 -1.246839 0.049742
C  1.958862 -0.242258 -0.162605
C  0.892796 -1.244664 0.301179
C  -1.554881 -1.455936 0.125171
C  -2.780079 -0.93599 -0.389064
C  -1.58578 -2.64075 0.900673
C  -3.99576 -1.600579 -0.152508
C  -2.813482 -3.300396 1.141388
C  -4.019115 -2.788917 0.614991
C  -2.370342 1.45006 -0.804791
C  -2.217762 1.778191 0.5615
C  -2.159236 2.419268 -1.811293
C  -1.839097 3.090403 0.921986
C  -1.782779 3.730336 -1.452797
C  -1.624809 4.046575 -0.088414
H  4.07826 -1.061216 -1.804999
H  3.11822 -2.41059 -1.121532
H  3.797272 0.940775 1.349918
H  4.500799 0.986836 -0.301019
H  5.580571 -2.94394 -1.197497
H  4.937133 -2.973177 0.470647
H  5.360539 -0.859245 2.023635
H  6.285522 0.517684 1.355542
H  7.111311 -1.730838 0.459151
H  6.524003 -0.660212 -0.836827
H  1.833334 -0.054277 -1.254503
H  1.783844 0.72049 0.350161
H  0.884607 -1.308896 1.406359
H  1.08058 -2.254078 -0.116853
H  -0.659461 -3.058001 1.30605
H  -4.909112 -1.17738 -0.581876
H  -2.819862 -4.21843 1.738818
H  -4.967722 -3.303663 0.796526
H  -2.39213 1.026471 1.3370
H  -2.287626 2.135582 -2.859589
H  -1.71746 3.360091 1.974975
H  -1.614062 4.489113 -2.22221
