program: Gaussian 09
title: 000213425
version: EM64L-G09RevD.01
frameworkgroup: C1[X(C16H18ClNO2)]
method: RPBEPBE
basis: SDD
operation: Freq
keyword: #p
keyword: freq=noraman
keyword: PBEPBE/SDD
title: #p freq=noraman PBEPBE/SDD
converged: YES YES NO NO
title: Mulliken charges:
elementType: Cl O O N C C C C C C C C C C C C C C C C H H H H H H H H H H H H H H H H H H
charge: -0.072201 -0.261568 -0.300142 -0.096701 -0.381786 -0.286352 0.267787 -0.613874 -0.615109 0.155780 -0.339684 -0.337073 -0.239126 -0.229600 0.389441 -0.319253 -0.372563 -0.205344 -0.181998 -0.118441 0.227259 0.211938 0.207785 0.228058 0.217287 0.197061 0.227226 0.222369 0.193788 0.229384 0.254317 0.257662 0.227433 0.231849 0.258168 0.259500 0.251848 0.254874
chargesum: 0.00000
title: Mulliken charges with hydrogens summed into heavy atoms:
elementType: Cl O O N C C C C C C C C C C C C C C C C
charge: -0.072201 -0.261568 -0.300142 -0.096701 0.057411 0.149491 0.267787 0.027699 0.030432 0.155780 -0.085367 -0.079411 -0.011694 0.002249 0.389441 -0.061085 -0.113062 0.046504 0.072876 -0.118441
polarizability: 2.28556032e+02 4.24238132e+01 2.12118897e+02 1.65121857e+01 -9.77774864e-01 1.51096256e+02
1716.lowfreq: -7.5548 -4.6885 0.0015 0.0018 0.0020 2.0179 11.7596 27.4517 29.3389
frequency: 11.2422 27.3861 29.3017 40.9140 59.3694 67.5408 91.7298 109.7821 133.3444 165.6850 194.8870 200.4265 213.5393 223.5305 250.7462 280.3829 295.7712 315.8957 331.8692 366.5323 400.7482 413.7399 416.3135 441.6659 456.7298 489.2774 513.5132 544.8784 569.6615 600.2734 621.0501 632.3852 690.4274 719.9122 742.2700 756.2941 779.8855 808.2427 814.5006 822.3392 834.9382 848.4974 857.5195 926.8766 934.7841 950.4828 969.0777 970.4956 992.3906 1033.5029 1035.5382 1036.9793 1061.4395 1066.8241 1089.0980 1093.9803 1095.8690 1102.8228 1138.7865 1158.6455 1162.8136 1166.8645 1174.4333 1202.1947 1245.6580 1251.0195 1268.2009 1269.6451 1284.0255 1293.4517 1329.0500 1371.2282 1377.0073 1391.1801 1401.4431 1420.7209 1436.2181 1443.1435 1459.8511 1465.9935 1469.4222 1470.2181 1476.1994 1481.0996 1487.3378 1489.5364 1583.9650 1590.4647 1597.4334 1611.1588 2859.7707 2869.3999 2900.7795 2971.2401 3022.1473 3026.0681 3035.1420 3060.7844 3079.9228 3083.0977 3137.2200 3152.7652 3153.7175 3160.2274 3164.6538 3173.3330 3176.2252 3180.0635
redmass: 6.4190 3.3847 2.9238 4.3920 4.2381 5.4947 3.0942 5.9156 2.2896 5.5166 3.0773 3.5040 1.2891 2.0820 1.8584 5.6961 5.2161 5.0728 4.6293 2.7319 5.5447 2.9932 2.7925 2.9160 3.9113 2.8769 4.1579 4.5118 6.7441 6.0436 7.1190 6.3036 3.6797 4.6735 3.3385 1.4923 5.0405 1.2579 1.3638 1.5806 2.8970 1.4812 5.9538 1.3739 1.3313 1.3460 1.3077 8.1249 4.0498 2.1150 1.6138 2.0220 1.6037 2.6211 1.4885 2.0749 2.4210 1.3041 1.4256 1.5779 1.3913 1.1692 1.4795 3.1321 1.9845 3.0190 2.3171 1.6072 1.2535 1.2291 1.3642 5.8059 3.5150 1.8677 3.9570 1.1434 2.3613 1.1585 1.0523 2.3357 1.1604 1.1384 1.0811 1.3780 1.0610 1.4368 6.7740 7.5605 7.0351 6.9923 1.0561 1.0567 1.0693 1.0562 1.0739 1.0738 1.0993 1.0982 1.1008 1.1008 1.0856 1.0898 1.0882 1.0886 1.0940 1.0968 1.1003 1.0977
irintensity: 0.1443 0.2630 0.1665 0.7155 0.7386 0.4514 0.5988 1.2343 3.7245 0.9040 0.8512 0.2432 1.0076 0.5018 1.9229 1.4893 0.6576 0.8850 2.8907 10.8711 5.5871 0.1133 3.4139 4.0406 16.0876 21.2177 2.4865 3.0024 1.3710 2.7361 7.9819 8.7214 1.9870 6.4933 47.3257 81.7415 11.2565 1.8400 0.5384 79.8112 1.1962 0.2799 13.2119 3.0249 0.0745 0.2645 0.4480 87.7683 43.1038 38.1633 23.4264 36.7688 4.8906 52.5614 12.6955 10.3908 58.1643 16.4150 2.9132 16.9939 5.2236 27.6853 11.8559 175.7740 85.3525 250.8700 9.5983 28.8055 0.3000 2.2511 1.9329 5.4461 8.9442 4.9773 1.4671 3.2009 30.8544 5.1369 8.3023 226.2909 46.2602 40.7036 28.0033 120.8031 7.6380 31.8382 17.5477 6.9332 17.0200 29.2032 64.4363 149.7483 83.6831 36.2478 38.0911 50.8100 10.7634 30.4904 29.3140 58.1771 1.7107 16.5668 3.8511 2.6219 17.1172 4.3352 12.8321 1.7589
temp: 298.150 k
press: 1.00000 atm
elementType: 17 8 8 7 6 6 6 6 6 6 6 6 6 6 6 6 6 6 6 6 1 1 1 1 1 1 1 1 1 1 1 1 1 1 1 1 1 1
symmnumber: 1
zpe: 793842.3 jmol-1
zpe.correction: 0.302359 hartree
zpe.thermalcorrener: 0.322209 hartree
zpe.thermalcorrenthalpy: 0.323153 hartree
zpe.thermalcorrgfe: 0.250507 hartree
zpe.sumelectzpe: -1284.239269 hartree
zpe.sumelectthermal: -1284.219419 hartree
zpe.sumelectthermalent: -1284.218475 hartree
zpe.sumelectthermalfe: -1284.291121 hartree
dipole: -3.0530 0.9728 -0.9361
dipole: 3.3382
quadrupole: -132.0266 -114.4750 -120.8540
quadrupole: -1.1625 8.2944 3.1483
quadrupole: -9.5748 7.9769 1.5979 -1.1625 8.2944 3.1483
hfenergy: -1284.5416279 hartree
pointgroup: C01 [X(C16H18Cl1N1O2)]
dipole: 0.2985848 1.2460901 0.2881176 debye
polarizability: 253.4049782|29.4953252|188.8031428|-2.8743179|10.5557972|149.5630648 unknown
InChI: InChI=1S/C16H18ClNO2/c1-18(2)11-12-19-15-5-3-4-6-16(15)20-14-9-7-13(17)8-10-14/h3-10H,11-12H2,1-2H3
charge 0 multiplicity 1
38 atoms
Cl -3.566394 -4.023209 1.38987
O  0.349978 0.96006 -0.352066
O  1.302275 -1.520406 -1.145582
N  -2.3044 3.550533 0.043415
C  -1.660735 2.281417 -0.368597
C  -0.173125 2.292019 0.009568
C  1.699086 0.696345 -0.113709
C  -2.688355 3.568894 1.470677
C  -3.425754 3.946153 -0.832977
C  2.156568 -0.604882 -0.478572
C  2.620294 1.614136 0.447447
C  3.504344 -0.96452 -0.306548
C  3.973659 1.243213 0.624687
C  4.422044 -0.040701 0.246727
C  0.169326 -2.048437 -0.485961
C  -0.034625 -1.965555 0.910289
C  -0.748552 -2.734239 -1.31324
C  -1.176741 -2.569232 1.482177
C  -1.887862 -3.339248 -0.743357
C  -2.087458 -3.245128 0.648694
H  -1.738474 2.175981 -1.465144
H  -2.145255 1.381415 0.080682
H  -0.031296 2.465606 1.09527
H  0.360503 3.081298 -0.553939
H  -1.817614 3.338115 2.108892
H  -3.496965 2.834279 1.714478
H  -3.045668 4.577353 1.745248
H  -3.790813 4.945528 -0.534495
H  -4.292893 3.239765 -0.795473
H  -3.079007 4.010167 -1.879209
H  2.29301 2.618289 0.732325
H  3.816273 -1.966497 -0.617064
H  4.675283 1.966386 1.054172
H  5.47089 -0.324384 0.37788
H  0.68387 -1.441242 1.547287
H  -0.562201 -2.78337 -2.389672
H  -1.348297 -2.514156 2.561083
H  -2.606719 -3.871745 -1.372364
