program: Gaussian 09
title: 000213523
version: EM64L-G09RevD.01
frameworkgroup: C1[X(C22H32O2S)]
method: RPBEPBE
basis: SDD
operation: Freq
keyword: #p
keyword: freq=noraman
keyword: PBEPBE/SDD
title: #p freq=noraman PBEPBE/SDD
converged: YES YES NO NO
title: Mulliken charges:
elementType: S O O C C C C C C C C C C C C C C C C C C C C C C H H H H H H H H H H H H H H H H H H H H H H H H H H H H H H H H
charge: 0.171787 -0.290896 -0.456167 -0.042313 -0.243628 0.213563 -0.422922 0.688157 0.475776 -0.434240 0.052725 0.191798 -0.432441 -0.381016 -0.642340 -0.778756 -0.758605 -0.688426 -0.753698 0.177739 -0.714642 -0.699408 -0.351533 -0.357107 -0.696250 0.204542 0.212238 0.224733 0.186692 0.241228 0.246254 0.190207 0.205417 0.258086 0.217026 0.224495 0.213752 0.214213 0.225954 0.226118 0.257534 0.275007 0.215856 0.210981 0.243320 0.230801 0.231053 0.239242 0.223760 0.193020 0.184282 0.189205 0.194494 0.358254 0.210778 0.213827 0.210475
chargesum: 0.00000
title: Mulliken charges with hydrogens summed into heavy atoms:
elementType: S O O C C C C C C C C C C C C C C C C C C C C C C
charge: 0.171787 -0.290896 -0.097913 0.162229 -0.031390 0.213563 -0.011496 0.688157 0.475776 -0.434240 0.052725 0.191798 0.055041 0.014608 -0.384253 -0.123483 -0.092320 -0.155885 -0.537842 0.177739 -0.029540 -0.005353 0.025769 0.026592 -0.061171
polarizability: 3.56468364e+02 -2.83423119e+01 2.68828950e+02 3.24755835e+01 1.71300631e+01 2.02614135e+02
1716.lowfreq: -6.4178 -0.0015 -0.0003 0.0007 2.5620 6.9165 14.3928 17.3199 37.3621
frequency: 13.4367 16.6224 37.3117 39.0652 59.1162 66.3747 81.7059 99.6031 102.6685 118.5309 119.6177 127.9253 140.3029 168.4336 182.7090 189.2570 204.2695 209.9829 221.4725 228.8096 229.2290 233.5586 240.6250 253.2816 265.2074 288.1258 300.6188 321.7371 335.0731 343.1540 350.1902 371.4756 381.9876 400.3656 402.9926 429.6347 447.8093 468.9750 488.1935 526.1712 552.0601 566.1755 578.1524 589.5250 601.5797 614.8427 642.3248 663.2791 688.4669 721.9774 734.7677 744.2053 766.3357 782.5115 803.7842 828.0414 833.7620 858.2852 871.5052 883.5077 897.5676 914.8900 928.2465 941.6726 948.3695 958.5833 968.1732 983.2894 984.8425 998.3456 1006.8945 1023.0169 1026.6544 1034.1422 1042.6992 1059.3366 1071.5177 1077.0618 1089.9723 1125.3813 1129.2400 1135.5285 1143.1328 1154.6834 1173.2022 1178.6798 1182.1170 1199.6852 1210.0220 1231.0005 1236.9418 1257.7052 1266.1246 1266.7396 1270.7551 1284.4654 1287.4029 1289.6381 1293.4593 1302.1503 1310.5436 1323.0362 1339.2831 1348.5744 1353.5716 1358.3546 1374.0801 1381.9758 1388.6385 1389.9434 1390.1660 1394.0203 1419.6724 1446.9724 1450.4678 1457.0789 1458.3793 1458.5235 1463.3969 1467.9157 1469.2058 1470.0390 1473.6207 1476.1514 1479.4882 1480.4012 1481.6514 1487.9074 1494.7321 1501.0007 1568.1582 1616.1018 1622.1152 2944.7340 2952.4109 2960.0117 2964.5718 2969.1021 2971.7073 2973.8344 2977.0927 2978.5709 2986.7506 2989.7812 2990.4060 2999.4386 3004.4611 3020.3484 3035.0555 3040.0012 3062.3303 3068.1073 3070.1003 3072.1170 3073.1731 3075.2432 3082.4841 3088.5671 3094.2291 3098.9308 3100.1422 3112.2923 3121.2532 3156.7567 3576.6485
redmass: 4.3359 3.9053 3.1853 2.0165 4.0001 3.1476 3.7697 3.0217 3.8462 2.4549 2.2206 2.6917 3.3064 2.3813 2.5626 2.0032 1.0870 1.5804 1.9950 2.0076 1.5905 1.5565 2.0045 1.8843 2.6160 3.0873 3.1175 2.7583 2.7930 3.3421 1.2541 2.5152 3.6091 3.9494 3.2368 3.2243 4.2974 3.9706 4.2409 4.6709 5.9861 3.7659 3.8678 4.7252 5.4118 3.9307 3.9506 3.3243 3.9820 1.0768 3.4419 1.1732 2.5812 2.5244 3.2569 1.2831 1.6905 2.2474 1.5717 2.0524 2.7098 2.0606 1.5411 1.5071 1.5161 1.7508 4.0015 1.8929 1.6657 1.3214 2.8207 2.9054 1.5626 2.5979 2.6647 3.4226 2.1629 2.0564 1.8033 1.2555 2.3995 1.9443 2.1354 1.9473 1.6971 1.4027 1.2837 3.3311 1.4660 1.4339 1.6206 1.4206 1.4770 1.4308 1.8169 1.1729 1.4013 1.5139 1.3185 1.6289 2.0249 1.4545 1.5527 1.5750 3.3274 1.4738 1.2166 1.2630 1.2199 2.0292 1.6482 1.2290 3.4374 1.0923 1.0532 1.0997 1.0588 1.0663 1.0700 1.0640 1.0549 1.0756 1.0648 1.0426 1.0678 1.0647 1.0585 1.0856 1.1268 2.9696 6.5304 8.2080 8.4149 1.0769 1.0587 1.0599 1.0625 1.0645 1.0363 1.0405 1.0435 1.0683 1.0345 1.0969 1.0666 1.0355 1.0990 1.1027 1.0605 1.1041 1.0990 1.1006 1.0993 1.0991 1.0937 1.0993 1.0987 1.1000 1.1010 1.0907 1.0996 1.1008 1.1077 1.0913 1.0657
irintensity: 0.0970 0.2093 0.0619 0.0087 0.6555 0.3438 0.2965 0.0202 1.9656 0.8180 0.3935 0.0904 0.8582 0.5521 0.7873 0.3003 0.2397 0.1775 1.4690 0.7522 0.1156 0.8855 2.0696 3.3802 1.6119 4.3360 2.8079 1.4955 2.9186 5.2628 92.7468 7.8642 0.8441 4.5041 1.2205 0.9593 6.2361 1.7759 2.5262 1.6315 1.9452 5.5347 2.5675 1.6173 5.7083 0.3713 7.1350 14.0972 3.9918 15.1325 10.6218 0.4366 9.7280 5.5704 13.4710 5.8434 26.0162 7.4292 22.4422 9.3512 4.2452 10.0694 1.7475 12.0664 5.9330 28.7203 59.4658 4.6684 11.4825 0.3145 93.7285 62.2706 11.6067 1.1603 6.8990 11.0795 3.4392 6.2517 4.6590 6.1981 11.7740 30.3038 14.3508 8.4445 19.8931 0.5932 38.1080 26.8341 1.8122 5.7044 60.5983 4.1599 15.7721 30.4720 34.1529 2.5029 10.2100 6.8246 2.2923 20.7636 23.4964 4.9067 4.2696 0.5705 2.6723 1.4066 29.5763 14.6255 15.2476 4.5050 9.7274 35.0654 54.7852 10.8170 3.9984 5.8215 8.7864 3.5438 1.3638 6.7644 13.6246 0.3579 7.8972 11.7717 0.7712 14.6711 9.8043 20.1825 5.4434 42.7528 43.2108 26.3418 89.3353 7.5799 1.8918 7.9362 4.7949 84.7086 38.0772 24.5801 62.9407 65.0277 14.3885 0.4115 19.6586 15.9729 2.9234 0.5596 36.0247 132.4046 35.8717 89.5575 53.1528 42.2784 11.6459 66.4490 40.6197 7.0181 20.3766 22.2893 26.5425 22.4262 16.6919 4.6665 28.9260
temp: 298.150 k
press: 1.00000 atm
elementType: 16 8 8 6 6 6 6 6 6 6 6 6 6 6 6 6 6 6 6 6 6 6 6 6 6 1 1 1 1 1 1 1 1 1 1 1 1 1 1 1 1 1 1 1 1 1 1 1 1 1 1 1 1 1 1 1 1
symmnumber: 1
zpe: 1277670.7 jmol-1
zpe.correction: 0.486639 hartree
zpe.thermalcorrener: 0.514414 hartree
zpe.thermalcorrenthalpy: 0.515358 hartree
zpe.thermalcorrgfe: 0.427468 hartree
zpe.sumelectzpe: -1404.126768 hartree
zpe.sumelectthermal: -1404.098993 hartree
zpe.sumelectthermalent: -1404.098049 hartree
zpe.sumelectthermalfe: -1404.185939 hartree
dipole: 1.6924 0.7732 1.7093
dipole: 2.5266
quadrupole: -159.9972 -152.5237 -158.0098
quadrupole: -0.6416 2.1871 4.6514
quadrupole: -3.1536 4.3199 -1.1662 -0.6416 2.1871 4.6514
hfenergy: -1404.6134069 hartree
pointgroup: C01 [X(C22H32O2S1)]
dipole: 0.6355524 -0.274263 -0.7134456 debye
polarizability: 350.7420746|32.213951|269.9459916|-40.6362275|15.5484737|207.2233826 unknown
InChI: InChI=1S/C22H32O2S/c1-6-7-8-9-14(2)15(3)16-12-18(23)20-17-10-11-25-21(17)22(4,5)24-19(20)13-16/h12-15,23H,6-11H2,1-5H3
charge 0 multiplicity 1
57 atoms
S  -5.134499 -1.532969 0.920736
O  -2.12177 1.288558 1.292031
O  -0.675593 -1.865328 -2.148899
C  3.109965 2.020987 0.488436
C  2.295795 1.963075 -0.850287
C  -3.581822 0.941188 1.089931
C  3.409946 0.605985 1.067613
C  0.998357 1.164482 -0.69415
C  -2.681913 -1.090761 -0.143008
C  -3.655908 -0.500474 0.61873
C  -1.452586 -0.346216 -0.42834
C  -1.200951 0.842848 0.329441
C  -3.033179 -2.489556 -0.642668
C  4.295582 -0.309474 0.189609
C  -0.004777 1.574704 0.218163
C  4.409318 2.852507 0.343155
C  1.985884 3.377943 -1.412207
C  -4.158856 -3.04208 0.263255
C  0.759219 0.015095 -1.484792
C  -0.441209 -0.719852 -1.353677
C  -4.204714 1.178435 2.473037
C  -4.15784 1.901905 0.022236
C  4.618855 -1.65618 0.876769
C  5.478714 -2.598507 0.003815
C  5.807518 -3.936072 0.702047
H  2.468062 2.537257 1.235177
H  2.92533 1.440346 -1.599887
H  2.452658 0.086046 1.270114
H  3.906682 0.737555 2.051779
H  -3.369345 -2.424538 -1.696119
H  -2.162363 -3.165771 -0.633342
H  3.784441 -0.516009 -0.772856
H  5.246009 0.203895 -0.06112
H  0.119337 2.464657 0.842024
H  5.024574 2.764819 1.258226
H  4.197509 3.924892 0.187349
H  5.024786 2.504656 -0.508279
H  1.449893 3.994435 -0.66611
H  1.344986 3.30651 -2.309363
H  2.909865 3.911418 -1.695754
H  -4.865787 -3.697072 -0.26796
H  -3.75467 -3.559436 1.148651
H  1.515563 -0.305589 -2.21495
H  -5.296432 1.016297 2.437621
H  -3.769325 0.491292 3.216651
H  -4.010086 2.217214 2.790046
H  -4.054747 2.948238 0.359801
H  -3.624178 1.780371 -0.936399
H  -5.227315 1.683913 -0.148586
H  3.67078 -2.167789 1.144881
H  5.147095 -1.461763 1.833931
H  4.946014 -2.798655 -0.948812
H  6.421078 -2.081492 -0.270817
H  0.095797 -2.021013 -2.748562
H  6.3724 -3.765192 1.637969
H  6.41671 -4.594254 0.055253
H  4.882146 -4.482384 0.965865
