program: Gaussian 09
title: 000213429
version: EM64L-G09RevD.01
frameworkgroup: C1[X(C20H26ClNO2)]
method: RPBEPBE
basis: SDD
operation: Freq
keyword: #p
keyword: freq=noraman
keyword: PBEPBE/SDD
title: #p freq=noraman PBEPBE/SDD
converged: YES YES NO NO
title: Mulliken charges:
elementType: Cl O O N C C C C C C C C C C C C C C C C C C C C H H H H H H H H H H H H H H H H H H H H H H H H H H
charge: -0.072635 -0.260679 -0.300199 -0.115743 -0.336829 -0.336642 -0.412995 -0.362734 -0.357490 -0.303235 -0.683024 -0.683198 0.269027 0.154103 -0.339479 -0.337634 -0.239167 -0.229960 0.389682 -0.318393 -0.372832 -0.205833 -0.182170 -0.118121 0.187720 0.201351 0.187916 0.200614 0.229293 0.222526 0.196132 0.213111 0.196196 0.209963 0.224031 0.214975 0.207047 0.211054 0.220562 0.207899 0.209638 0.220565 0.254735 0.257484 0.227178 0.231645 0.258532 0.259226 0.252045 0.254744
chargesum: 0.00000
title: Mulliken charges with hydrogens summed into heavy atoms:
elementType: Cl O O N C C C C C C C C C C C C C C C C C C C C
charge: -0.072635 -0.260679 -0.300199 -0.115743 0.052241 0.051887 0.038823 0.046509 0.048669 0.135771 -0.044361 -0.045096 0.269027 0.154103 -0.084744 -0.080150 -0.011989 0.001685 0.389682 -0.059861 -0.113606 0.046212 0.072574 -0.118121
polarizability: 2.29171013e+02 -7.96911530e+00 3.04135272e+02 -8.81276145e+00 1.52186749e+01 1.94768823e+02
1716.lowfreq: -9.4922 -2.6496 -0.0020 -0.0005 0.0010 2.2214 9.3527 16.8530 26.8382
frequency: 8.9657 15.7814 26.3064 34.4398 45.4364 56.6179 60.8006 67.9345 70.2372 82.1514 90.2612 115.8058 145.1577 163.7962 176.4350 200.3560 213.2731 217.4185 226.4150 234.8005 243.8593 278.8744 290.3239 312.3688 318.4709 339.3979 352.4939 400.5870 402.6014 414.4128 454.1044 469.1190 489.7188 507.1563 521.1778 545.8360 574.6280 600.0795 620.9982 632.3092 691.1832 719.4858 743.3817 746.6082 747.4309 757.0229 783.7647 805.3868 809.3085 822.8843 832.0321 847.3405 856.2438 870.6048 876.1655 897.4041 918.1309 927.2007 935.7690 951.0631 963.0559 968.9956 992.1102 1031.6171 1036.4255 1044.4031 1059.4377 1066.4070 1069.3975 1092.3567 1095.2719 1102.5501 1103.1183 1115.8247 1129.6569 1158.6064 1160.8087 1166.3929 1173.9764 1197.7316 1201.6488 1226.3651 1248.2161 1254.9207 1256.5739 1267.5613 1282.8961 1283.9500 1288.7943 1292.3546 1308.3918 1315.4909 1329.7842 1368.4972 1369.9054 1372.4753 1379.2167 1389.4089 1392.1293 1396.1908 1401.1214 1435.8188 1464.2771 1465.7006 1467.6481 1469.9953 1476.0128 1477.9237 1477.9845 1479.9800 1480.7583 1486.1533 1489.8613 1490.0948 1583.5436 1590.2366 1597.4105 1611.2882 2855.3942 2863.8430 2924.0833 2967.5559 2974.2054 2974.6133 2982.2421 2986.6928 3008.1447 3021.3988 3032.5496 3039.0464 3042.3463 3062.4110 3071.1496 3071.8133 3076.9388 3077.1607 3136.9232 3152.7236 3153.0101 3159.7245 3164.4837 3172.1426 3176.2167 3179.5699
redmass: 6.5599 4.4480 4.1530 4.0153 3.9083 4.3110 3.6111 3.4900 1.8142 5.0760 1.6147 4.6434 2.6465 5.8824 3.1468 2.1865 2.7259 2.6244 1.4437 1.3243 3.7026 6.2013 4.6622 4.8850 3.8566 3.7090 2.9894 5.1569 4.2231 3.0147 3.8807 3.8576 2.9237 3.6048 3.5059 4.3058 6.4831 6.0404 7.1214 6.3074 3.6967 4.6536 2.4852 1.1080 1.1829 1.5380 5.0133 1.3042 1.2570 1.5752 2.4432 1.4725 5.4826 1.3370 1.2089 1.5472 2.1270 1.3733 1.3295 1.3450 8.2826 1.3056 4.0435 2.5778 2.0343 2.7437 2.1436 2.6291 2.4308 2.2563 2.4102 2.0144 1.3609 2.1645 1.8167 1.5890 1.4289 1.1637 1.4651 2.0826 3.1114 1.5005 3.1228 1.4360 1.3832 1.5241 1.1091 1.2524 1.1772 1.1562 1.3652 1.4306 1.3439 1.4041 2.0419 3.1810 3.1367 1.2906 1.5775 1.2342 3.9276 2.3716 1.2047 2.0607 1.0730 1.1272 1.0735 1.0642 1.0574 1.2934 1.0907 1.3726 1.1666 1.1052 6.7481 7.5090 7.0734 7.0160 1.0707 1.0705 1.0695 1.0562 1.0356 1.0359 1.0618 1.0616 1.0870 1.0882 1.1017 1.1007 1.0985 1.0973 1.1011 1.1011 1.0991 1.0990 1.0856 1.0897 1.0883 1.0886 1.0940 1.0970 1.1003 1.0977
irintensity: 0.0604 0.0625 0.0590 0.0983 0.3954 0.5672 0.2931 0.0288 0.1302 0.1186 0.0258 1.0903 2.3526 1.1346 1.3252 0.8208 0.6987 0.3906 0.5328 0.4872 1.7813 1.0153 0.1644 0.4853 0.2172 2.7904 3.2995 10.3492 5.1603 0.4131 12.2781 3.0616 21.8299 3.9648 6.2173 4.0704 1.1019 2.7070 8.2744 8.7663 2.0145 4.8761 36.7710 10.5737 13.1776 82.9423 8.2336 2.4586 1.8797 81.6243 6.3822 0.4886 10.6841 4.4439 2.6742 2.2199 1.7682 2.6798 0.1461 0.1948 114.0456 0.4563 42.2636 27.8689 18.0790 19.6569 20.0980 51.6238 31.0555 18.1693 63.0507 9.2918 18.7526 4.2559 1.6699 9.9681 8.8857 30.2478 13.9075 12.8007 180.8858 8.1761 314.7291 48.7119 3.7908 15.7098 0.2436 0.2031 6.9865 4.0934 1.8552 8.8654 2.0125 1.3556 8.2898 1.7039 5.8892 13.5690 8.5114 17.4444 1.6437 31.1111 24.6661 231.1357 3.6103 42.6653 0.9836 18.7214 9.0813 108.6263 2.8038 34.1092 21.2886 16.9232 18.3366 7.1744 18.3349 31.2559 36.1200 134.6882 52.1980 42.8979 50.6323 34.3267 25.7196 24.5681 20.0344 12.4162 11.7757 9.6550 21.2270 34.4633 64.3372 111.4053 20.4624 71.4640 1.8852 17.9676 2.0287 2.6394 17.4895 4.1619 13.2570 1.9227
temp: 298.150 k
press: 1.00000 atm
elementType: 17 8 8 7 6 6 6 6 6 6 6 6 6 6 6 6 6 6 6 6 6 6 6 6 1 1 1 1 1 1 1 1 1 1 1 1 1 1 1 1 1 1 1 1 1 1 1 1 1 1
symmnumber: 1
zpe: 1087312.3 jmol-1
zpe.correction: 0.414135 hartree
zpe.thermalcorrener: 0.439517 hartree
zpe.thermalcorrenthalpy: 0.440461 hartree
zpe.thermalcorrgfe: 0.354158 hartree
zpe.sumelectzpe: -1441.134374 hartree
zpe.sumelectthermal: -1441.108993 hartree
zpe.sumelectthermalent: -1441.108049 hartree
zpe.sumelectthermalfe: -1441.194352 hartree
dipole: -3.1711 1.7304 0.7987
dipole: 3.6998
quadrupole: -150.7134 -151.6657 -146.4258
quadrupole: 8.2706 0.8570 6.5926
quadrupole: -1.1118 -2.0641 3.1758 8.2706 0.8570 6.5926
hfenergy: -1441.5485098 hartree
pointgroup: C01 [X(C20H26Cl1N1O2)]
dipole: -0.7501527 1.1599579 0.4588644 debye
polarizability: 238.9036126|28.3528711|291.3486141|-2.0978882|22.2334692|197.8228817 unknown
InChI: InChI=1S/C20H26ClNO2/c1-3-13-22(14-4-2)15-16-23-19-7-5-6-8-20(19)24-18-11-9-17(21)10-12-18/h5-12H,3-4,13-16H2,1-2H3
charge 0 multiplicity 1
50 atoms
Cl 1.326642 -5.774077 -0.493606
O  0.523548 0.741464 -0.24043
O  2.920087 -0.02755 -1.405238
N  -3.190416 0.704562 0.123856
C  -4.110184 -0.407208 0.478145
C  -3.785762 1.708808 -0.796438
C  -1.841427 0.253042 -0.293118
C  -3.811368 -1.021252 1.862715
C  -4.736205 2.697332 -0.086647
C  -0.777251 1.183986 0.303203
C  -4.753182 -2.199727 2.192671
C  -5.372965 3.701957 -1.071231
C  1.672343 1.41492 0.175213
C  2.901758 0.967219 -0.39371
C  1.696014 2.490295 1.0968
C  4.114818 1.596303 -0.06472
C  2.921026 3.114139 1.429254
C  4.131263 2.675237 0.850347
C  2.511545 -1.348619 -1.113703
C  2.353646 -1.849321 0.198694
C  2.319936 -2.184826 -2.236675
C  1.991511 -3.201861 0.386677
C  1.960276 -3.535693 -2.050571
C  1.798604 -4.024856 -0.738721
H  -4.09395 -1.21568 -0.296334
H  -5.141417 -0.006888 0.489822
H  -4.327745 1.216334 -1.643705
H  -2.960013 2.287851 -1.254211
H  -1.658271 -0.771331 0.075299
H  -1.720643 0.221511 -1.399857
H  -2.760238 -1.370433 1.898602
H  -3.904292 -0.224534 2.624958
H  -5.534973 2.137923 0.438745
H  -4.16368 3.23087 0.695917
H  -0.780884 1.109197 1.407945
H  -0.961101 2.238587 0.013573
H  -5.811935 -1.877727 2.19557
H  -4.651372 -3.012363 1.448714
H  -4.528277 -2.624043 3.187748
H  -4.598512 4.289401 -1.60032
H  -5.980108 3.18269 -1.836847
H  -6.033227 4.413982 -0.544023
H  0.765974 2.850838 1.545846
H  5.031684 1.232955 -0.539108
H  2.92167 3.94811 2.139349
H  5.077819 3.162868 1.103317
H  2.511277 -1.199682 1.064722
H  2.451511 -1.768821 -3.23943
H  1.865979 -3.604305 1.396092
H  1.807767 -4.192983 -2.911254
