program: Gaussian 09
title: 000213411
version: EM64L-G09RevD.01
frameworkgroup: C1[X(C19H23NO3)]
method: RPBEPBE
basis: SDD
operation: Freq
keyword: #p
keyword: freq=noraman
keyword: PBEPBE/SDD
title: #p freq=noraman PBEPBE/SDD
converged: YES YES NO NO
title: Mulliken charges:
elementType: O O O N C C C C C C C C C C C C C C C C C C C H H H H H H H H H H H H H H H H H H H H H H H
charge: -0.246184 -0.258075 -0.311233 -0.102813 -0.340563 -0.352657 -0.372364 -0.316683 -0.313439 -0.300247 0.264522 0.174260 -0.341057 -0.341855 0.236568 -0.241771 0.316890 -0.230268 -0.342752 -0.388859 -0.789034 -0.240461 -0.250269 0.199649 0.202758 0.215373 0.195130 0.207586 0.229668 0.191854 0.215808 0.215498 0.192633 0.223941 0.210957 0.252096 0.257127 0.226081 0.230283 0.251632 0.230153 0.211133 0.242350 0.239428 0.223893 0.223312
chargesum: 0.00000
title: Mulliken charges with hydrogens summed into heavy atoms:
elementType: O O O N C C C C C C C C C C C C C C C C C C C
charge: -0.246184 -0.258075 -0.311233 -0.102813 0.061844 0.057846 0.064891 0.090979 0.094692 0.134650 0.264522 0.174260 -0.088961 -0.084727 0.236568 -0.015689 0.316890 0.000015 -0.091120 -0.158707 -0.096123 -0.016569 -0.026957
polarizability: 2.17832314e+02 -1.32296723e+01 2.64055169e+02 -8.15120773e+00 -2.67902156e+00 1.78695336e+02
1716.lowfreq: -9.4650 -0.0001 0.0002 0.0007 4.5657 7.9828 18.8692 19.8328 22.3597
frequency: 18.7138 19.7995 22.1219 35.6586 48.1550 67.3215 84.7755 107.3642 127.3299 141.9347 152.1099 174.1034 180.3560 208.5575 236.4432 246.2408 254.0577 290.6762 310.2538 330.3562 374.0453 394.5440 412.6320 434.7355 440.0567 452.8365 470.2342 495.8133 530.2250 538.5738 547.5577 556.2067 587.2726 608.9432 614.1425 704.0781 713.7639 739.4910 749.3190 754.7519 764.7424 780.7727 801.5679 808.4503 822.6996 840.4028 847.4870 853.5105 863.1661 899.9323 926.2879 931.8060 968.6072 972.8535 976.5657 982.5282 1000.4109 1027.8104 1037.0012 1042.5328 1045.8976 1052.0356 1059.2518 1082.5691 1093.0337 1094.0982 1108.8852 1110.0150 1137.9138 1150.5387 1164.4572 1166.5018 1170.5205 1185.0592 1188.9142 1207.4027 1222.8791 1248.7283 1258.8510 1269.3888 1270.0971 1281.5829 1292.4112 1294.6630 1321.7700 1334.4509 1349.5851 1364.7964 1370.4361 1379.6966 1383.8866 1398.9149 1402.6291 1427.5131 1435.1730 1442.9063 1448.6612 1450.5303 1457.2077 1459.4527 1470.2828 1476.6899 1479.9728 1481.0350 1489.9779 1584.5805 1594.9145 1607.8710 1611.0614 2868.1195 2876.5397 2910.8177 2953.1317 2957.3593 2966.4494 2982.0748 3029.8069 3030.2396 3033.9726 3058.9853 3061.5263 3081.1037 3084.4638 3089.1858 3120.9621 3131.9014 3135.7825 3149.0323 3151.6357 3163.4270 3164.1033 3175.2986
redmass: 5.5316 3.7863 2.9666 4.6978 4.9139 4.4293 4.2696 3.4990 1.1367 2.1501 3.6698 4.3965 4.6471 3.8618 2.5954 2.4639 3.4189 4.9574 3.9548 2.7480 2.9889 2.3893 3.0749 3.6650 3.3774 5.1195 2.7614 4.2882 4.2932 4.2255 4.4767 4.9355 5.2673 2.4449 5.1736 4.4522 3.0753 2.8565 2.5395 1.3244 1.9439 4.5420 4.4102 2.0296 1.8196 1.5847 1.4493 1.3943 4.8454 2.2481 1.3741 1.3677 1.3037 1.3152 7.7222 1.6104 2.6673 2.1775 2.0374 2.0309 1.5260 2.3027 1.8547 2.5521 3.4595 2.5317 2.3404 1.9745 2.5161 1.7695 1.7749 1.1803 1.1797 2.2815 1.0643 1.3034 2.7266 3.1807 1.4377 1.5240 1.2909 1.4669 1.1759 1.3210 1.3081 1.2347 1.3327 1.5159 1.2831 4.9190 4.8539 1.3490 1.5421 2.0190 2.3605 1.0835 1.0792 1.0962 1.0464 1.0972 1.2289 1.3132 1.4458 2.1322 1.4719 6.6469 6.7350 6.5684 7.1928 1.0704 1.0690 1.0694 1.0667 1.0666 1.0565 1.0362 1.0924 1.0962 1.0920 1.0972 1.0969 1.0960 1.0977 1.1004 1.0862 1.0888 1.0855 1.0935 1.0898 1.0940 1.1005 1.1002
irintensity: 0.0425 0.0576 0.0810 0.0558 1.1393 1.2779 1.7642 0.8869 1.2925 2.4811 1.1764 0.6886 1.4682 2.2366 2.6662 0.2126 8.2996 1.8882 5.7074 5.0111 6.7047 0.7848 6.2220 7.6828 2.3871 6.1999 0.7196 1.2166 0.9050 0.9216 2.9116 4.3311 3.3395 2.7990 1.2077 0.2679 4.1099 18.6869 35.9298 113.2283 45.5845 4.0527 20.9708 3.4719 4.2527 0.2010 0.8803 1.4344 17.4708 8.0089 3.5373 1.3098 0.1394 0.8142 88.0096 2.7893 38.2027 9.5310 19.9106 14.2868 8.4670 21.8524 3.0747 10.8294 40.3300 50.2591 3.8808 98.1943 65.5884 4.8413 6.5533 31.9103 1.0262 134.1601 1.2151 6.1336 36.0084 283.5666 43.4091 18.1526 6.9184 3.5567 11.3120 6.3814 5.8144 3.2034 2.4928 1.6247 2.2313 11.2984 2.0278 16.1150 1.0494 22.9780 30.9048 3.2057 0.5601 17.2420 12.7285 3.9294 64.2344 3.4077 125.1144 109.6806 27.7877 21.7652 16.8036 36.8067 9.2025 48.1527 90.5414 68.3234 27.6561 103.7350 45.0643 29.4274 25.1474 37.9874 22.7412 43.2901 17.0247 39.3982 35.1171 25.5417 7.6445 12.6002 1.6573 29.1429 15.0036 19.5252 20.8769 12.8546
temp: 298.150 k
press: 1.00000 atm
elementType: 8 8 8 7 6 6 6 6 6 6 6 6 6 6 6 6 6 6 6 6 6 6 6 1 1 1 1 1 1 1 1 1 1 1 1 1 1 1 1 1 1 1 1 1 1 1
symmnumber: 1
zpe: 998165.8 jmol-1
zpe.correction: 0.380181 hartree
zpe.thermalcorrener: 0.401844 hartree
zpe.thermalcorrenthalpy: 0.402788 hartree
zpe.thermalcorrgfe: 0.326336 hartree
zpe.sumelectzpe: -1016.480467 hartree
zpe.sumelectthermal: -1016.458804 hartree
zpe.sumelectthermalent: -1016.457860 hartree
zpe.sumelectthermalfe: -1016.534312 hartree
dipole: 0.4453 1.1291 -1.0479
dipole: 1.6035
quadrupole: -153.3592 -122.9170 -132.8084
quadrupole: 0.2681 -1.8401 -0.4531
quadrupole: -16.9977 13.4445 3.5532 0.2681 -1.8401 -0.4531
hfenergy: -1016.8606482 hartree
pointgroup: C01 [X(C19H23N1O3)]
dipole: 0.2722634 0.3026318 -0.4819702 debye
polarizability: 215.1668843|-5.0916156|262.326934|-6.1183176|-20.5530076|183.0890012 unknown
InChI: InChI=1S/C19H23NO3/c1-16-6-2-3-7-17(16)23-19-9-5-4-8-18(19)22-15-12-20-10-13-21-14-11-20/h2-9H,10-15H2,1H3
charge 0 multiplicity 1
46 atoms
O  6.130686 -1.358576 0.736605
O  -0.045193 0.803254 -0.053352
O  -2.746957 0.859482 0.54097
N  3.38299 -0.652534 0.10608
C  4.141207 0.062252 1.167307
C  3.86549 -2.054015 -0.009942
C  1.914079 -0.550169 0.270726
C  5.645644 0.026367 0.852431
C  5.372726 -2.061148 -0.312884
C  1.401456 0.765799 -0.329831
C  -0.77444 1.895021 -0.53044
C  -2.174364 1.879853 -0.254811
C  -0.225071 2.989274 -1.241428
C  -2.991919 2.949494 -0.659862
C  -2.792156 -0.478574 0.062278
C  -1.05586 4.058128 -1.652171
C  -3.075798 -1.460139 1.049795
C  -2.436543 4.046452 -1.360266
C  -2.628204 -0.809159 -1.299409
C  -3.185365 -2.802414 0.616421
C  -3.244602 -1.060065 2.500686
C  -2.741489 -2.15943 -1.699525
C  -3.020244 -3.160801 -0.742868
H  3.965173 -0.402082 2.170353
H  3.805934 1.114913 1.219409
H  3.323374 -2.5544 -0.834175
H  3.680675 -2.633828 0.928771
H  1.593015 -0.61724 1.336886
H  1.430725 -1.386857 -0.264521
H  5.839849 0.57269 -0.095927
H  6.234006 0.477419 1.66851
H  5.771468 -3.088933 -0.326631
H  5.555388 -1.575033 -1.295684
H  1.588361 0.785852 -1.420943
H  1.891707 1.645224 0.135297
H  0.8449 3.020086 -1.46723
H  -4.057595 2.906572 -0.414364
H  -0.615412 4.90018 -2.196927
H  -3.077742 4.876618 -1.67276
H  -2.420223 -0.024843 -2.034522
H  -3.402431 -3.577371 1.361531
H  -3.408122 -1.945029 3.139285
H  -2.353755 -0.517541 2.866265
H  -4.101025 -0.372615 2.629427
H  -2.617061 -2.422065 -2.756058
H  -3.111387 -4.208374 -1.049507
