program: Gaussian 09
title: 000213419
version: EM64L-G09RevD.01
frameworkgroup: C1[X(C20H25NO3)]
method: RPBEPBE
basis: SDD
operation: Freq
keyword: #p
keyword: freq=noraman
keyword: PBEPBE/SDD
title: #p freq=noraman PBEPBE/SDD
converged: YES YES NO NO
title: Mulliken charges:
elementType: O O O N C C C C C C C C C C C C C C C C C C C C H H H H H H H H H H H H H H H H H H H H H H H H H
charge: -0.450307 -0.299935 -0.311499 -0.092773 -0.431513 -0.446211 -0.439184 -0.441461 -0.374751 -0.131112 -0.319144 0.294542 0.160479 -0.339265 -0.339364 -0.237169 0.229995 -0.231046 0.309345 -0.351828 -0.384852 -0.784165 -0.244352 -0.255870 0.230027 0.213669 0.256757 0.206776 0.226255 0.219193 0.213055 0.228929 0.224178 0.237076 0.218093 0.244162 0.228535 0.355935 0.254870 0.257943 0.227004 0.230892 0.258436 0.232816 0.215294 0.242876 0.232925 0.229363 0.226386
chargesum: 0.00000
title: Mulliken charges with hydrogens summed into heavy atoms:
elementType: O O O N C C C C C C C C C C C C C C C C C C C C
charge: -0.094373 -0.299935 -0.311499 -0.092773 0.012182 0.017321 0.006264 0.000522 0.086503 0.086981 0.153553 0.294542 0.160479 -0.084396 -0.081422 -0.010165 0.229995 -0.000154 0.309345 -0.093392 -0.152036 -0.093070 -0.014989 -0.029484
polarizability: 2.57242461e+02 2.90168342e+01 2.33754808e+02 5.05547935e+00 1.52979177e+01 1.91147631e+02
1716.lowfreq: -5.5957 0.0006 0.0007 0.0008 4.4469 8.6138 15.1788 22.9298 30.6886
frequency: 15.0059 21.5600 30.6272 35.1306 46.5152 66.3179 72.9148 84.8221 91.6606 107.4333 119.9397 137.3499 157.1955 168.9387 177.2511 209.0421 231.8541 248.1427 290.9913 310.3198 322.1765 396.8839 399.5360 424.7654 426.1724 432.2628 439.8438 445.2318 482.3963 506.5130 522.8845 538.5547 549.0618 584.6122 612.8389 614.2171 626.5840 660.7683 705.5870 712.5785 742.1819 756.4644 765.0313 767.7476 778.9499 803.9860 828.3487 838.8086 846.1447 856.2861 860.7726 862.9501 879.4459 907.2476 918.9742 929.3151 934.9841 936.7098 951.5885 969.7956 975.3718 983.5690 983.9872 1020.9918 1034.6907 1042.4830 1044.8202 1050.5396 1063.5999 1076.8667 1089.8417 1097.2048 1109.4486 1134.0327 1164.7212 1166.0683 1169.7759 1170.8719 1181.7997 1187.8007 1216.9201 1221.4354 1223.7347 1233.4440 1252.1503 1252.6934 1267.0397 1268.0812 1282.0504 1285.6032 1299.9547 1314.8856 1317.9099 1331.1827 1346.3257 1364.0211 1378.3668 1381.6790 1383.9695 1402.4615 1426.3280 1435.5336 1450.1101 1456.5018 1462.3643 1467.0455 1474.1355 1475.2856 1480.7919 1481.4330 1485.3224 1490.2333 1584.8156 1593.9810 1607.8966 1609.9104 2932.5284 2979.4440 2982.0772 2984.2912 2992.6841 3003.6167 3018.2474 3036.0996 3051.2387 3054.4544 3058.3916 3061.2817 3068.3842 3078.8170 3089.3365 3092.2524 3122.0751 3130.9883 3137.2156 3149.7564 3152.7758 3163.6409 3165.5326 3176.2825 3529.1010
redmass: 4.2683 4.7943 4.8603 3.9657 3.4424 4.2451 3.6329 3.6014 2.2565 1.3110 2.4030 2.9639 3.7136 3.6167 4.6124 3.5684 3.7660 3.8258 4.9240 6.3012 2.7972 3.3480 1.9725 1.4876 2.4831 3.5269 2.9343 2.0917 4.1595 4.4189 5.0319 3.7725 4.5189 6.8576 5.3868 2.1917 4.1852 3.5489 4.4967 3.2576 2.2805 1.2792 1.7349 1.6671 4.2164 4.7267 2.2918 3.1813 1.4823 1.5894 1.9662 3.0973 3.5193 2.5099 2.2717 1.4612 1.3642 1.7174 3.0153 1.3055 1.3027 1.9293 1.9109 2.7013 2.0346 2.0479 1.5223 2.4182 2.1166 1.8736 2.0710 2.2612 2.0189 1.8970 1.7896 1.1854 1.1993 1.2443 2.2127 1.2149 1.2540 2.0425 1.5459 1.4733 2.0958 1.5208 1.5047 1.3707 1.4654 1.3388 1.2596 1.2654 1.4810 1.3465 1.3201 1.3822 1.6136 3.4960 5.9924 1.2866 2.0128 2.2508 1.1723 1.0489 1.0792 1.0820 1.0898 1.2868 2.2236 1.1099 2.3500 1.1061 6.6294 6.7509 6.6043 7.1598 1.0668 1.0671 1.0368 1.0550 1.0630 1.0589 1.0640 1.0874 1.0971 1.0978 1.0967 1.1085 1.1025 1.0998 1.1052 1.1000 1.0856 1.0897 1.0856 1.0935 1.0901 1.1004 1.0940 1.1002 1.0652
irintensity: 0.0359 0.2070 0.2616 0.6976 0.1819 0.5004 0.6513 0.3916 0.6601 0.4037 0.2802 2.1903 0.4091 3.6524 1.2146 1.1153 3.2721 5.0931 1.3331 1.8227 0.5510 0.5216 1.2788 56.8713 5.0961 12.2106 7.6571 98.8434 0.9092 2.4362 5.4177 0.8915 0.4221 0.6670 1.1046 4.9387 1.3856 4.8990 0.3214 3.3510 24.0745 121.5645 41.5811 20.0054 13.4725 10.8476 8.5820 12.8000 0.5090 5.2213 6.1190 20.7138 12.4188 3.2431 18.2044 9.4074 1.0761 33.2483 40.4320 0.1267 0.2207 19.7970 9.0301 10.2165 17.6959 12.2816 8.3842 11.3774 79.3369 4.4183 11.4088 42.0949 89.2122 4.4484 7.8542 22.2112 1.5328 0.6066 107.9607 4.8871 6.6686 29.2899 14.4000 123.6562 139.3320 69.8262 15.2303 12.8532 3.9672 3.6801 3.3238 0.7211 16.8683 0.9898 1.8828 2.5101 21.1002 20.3031 4.9186 15.8178 22.2133 28.7505 86.0104 14.2805 8.4664 0.6987 8.5476 5.3747 156.7558 1.8068 99.0723 3.6134 17.4735 12.7599 37.0713 7.9955 42.0659 41.8357 27.7594 24.8644 40.2748 46.0712 53.8719 12.3015 17.4373 30.7049 18.1394 18.1877 3.2132 20.3716 91.7472 24.0880 4.2201 15.0423 1.7591 22.6464 15.0335 17.7574 15.7527 12.1128 12.5013
temp: 298.150 k
press: 1.00000 atm
elementType: 8 8 8 7 6 6 6 6 6 6 6 6 6 6 6 6 6 6 6 6 6 6 6 6 1 1 1 1 1 1 1 1 1 1 1 1 1 1 1 1 1 1 1 1 1 1 1 1 1
symmnumber: 1
zpe: 1071416.2 jmol-1
zpe.correction: 0.408081 hartree
zpe.thermalcorrener: 0.431306 hartree
zpe.thermalcorrenthalpy: 0.432250 hartree
zpe.thermalcorrgfe: 0.352487 hartree
zpe.sumelectzpe: -1055.714660 hartree
zpe.sumelectthermal: -1055.691435 hartree
zpe.sumelectthermalent: -1055.690490 hartree
zpe.sumelectthermalfe: -1055.770254 hartree
dipole: 1.0267 -0.8275 -2.4051
dipole: 2.7429
quadrupole: -132.6528 -133.1991 -148.6232
quadrupole: 4.2228 -0.5237 5.3716
quadrupole: 5.5056 4.9593 -10.4648 4.2228 -0.5237 5.3716
hfenergy: -1056.1227409 hartree
pointgroup: C01 [X(C20H25N1O3)]
dipole: -0.347448 -0.1262312 -1.0138385 debye
polarizability: 238.9253754|32.8674094|238.4379455|-4.5818231|-27.1986134|204.7815798 unknown
InChI: InChI=1S/C20H25NO3/c1-16-8-2-3-9-18(16)24-20-11-5-4-10-19(20)23-15-17(22)14-21-12-6-7-13-21/h2-5,8-11,17,22H,6-7,12-15H2,1H3
charge 0 multiplicity 1
49 atoms
O  -1.498774 1.424123 2.373145
O  0.322747 1.379744 0.289798
O  2.634011 0.020649 0.893944
N  -2.985815 0.042189 -0.826307
C  -4.474954 0.133766 -0.716647
C  -2.778076 -1.17711 -1.661531
C  -5.025994 -1.342505 -0.686094
C  -3.819867 -2.221805 -1.151044
C  -2.298763 0.005299 0.494763
C  -1.963977 1.437964 0.978705
C  -0.936577 2.128981 0.074218
C  1.48163 1.804962 -0.358453
C  2.663443 1.061194 -0.068571
C  1.556339 2.899528 -1.251563
C  3.894543 1.424523 -0.640196
C  2.797597 3.255145 -1.829714
C  1.924314 -1.177511 0.605911
C  3.968088 2.527341 -1.524385
C  1.623716 -1.989377 1.73346
C  1.58616 -1.56429 -0.708462
C  0.958577 -3.214791 1.490845
C  2.006988 -1.538231 3.127515
C  0.922586 -2.794438 -0.916811
C  0.605623 -3.623681 0.182471
H  -4.867559 0.666035 -1.603546
H  -4.759307 0.713999 0.178428
H  -1.733113 -1.521962 -1.596188
H  -2.992061 -0.918381 -2.717656
H  -5.363167 -1.628306 0.325412
H  -5.89156 -1.44792 -1.364172
H  -4.102246 -2.95074 -1.930993
H  -3.397362 -2.784772 -0.298975
H  -2.901014 -0.482673 1.293181
H  -1.356091 -0.563442 0.393878
H  -2.884226 2.049726 0.99135
H  -1.255966 2.052871 -0.98221
H  -0.78969 3.183806 0.376086
H  -0.568132 1.076056 2.362201
H  0.659095 3.477389 -1.490957
H  4.781188 0.838123 -0.379832
H  2.843797 4.107564 -2.515943
H  4.928457 2.809145 -1.96729
H  1.841391 -0.917542 -1.554225
H  0.714212 -3.856038 2.346265
H  1.638435 -2.246451 3.888815
H  3.104235 -1.450909 3.232224
H  1.596838 -0.53575 3.350002
H  0.666079 -3.103998 -1.936379
H  0.093604 -4.578998 0.02513
